program: Orca
programVersion: 5.0.2
elementType: Cl F F F O O O N N C C C C C C C C C C C C C C C C C C C C C C C C C C H H H H H H H H H H H H H H H H H H H H H H
charge: 0
multiplicity: 1
keywords: wb97x-d3
keywords: def2-TZVPP
keywords: def2/J RIJCOSX
keywords: DEFGRID2
keywords: scfconv7
keywords: smallprint printgap noloewdin
keywords: NOSOSCF
formula: C26H22ClF3N2O3
InChI: InChI=1/C26H22ClF3N2O3/c1-16(2)24(32-22-12-11-18(14-21(22)27)26(28,29)30)25(33)35-23(15-31)17-7-6-10-20(13-17)34-19-8-4-3-5-9-19/h3-14,16,23-24,32H,1-2H3
57 atoms
Cl 0.650142 4.206121 -2.271435
F  -4.248683 1.571698 0.664673
F  -4.277368 3.33053 -0.570872
F  -4.091223 1.390277 -1.471461
O  2.753502 -0.743979 0.757588
O  3.078183 0.055381 -1.304332
O  -1.883799 -2.685213 -0.682641
N  1.964306 2.480249 -0.252104
N  3.080867 -3.581164 2.396934
C  4.241392 2.221738 0.584094
C  2.823794 1.61994 0.512189
C  4.204201 3.576361 1.280746
C  5.212972 1.283449 1.291284
C  2.893776 0.242017 -0.133444
C  0.608876 2.363049 -0.281189
C  2.914589 -2.072505 0.270026
C  -0.160151 3.132591 -1.175166
C  -0.101599 1.517281 0.582342
C  1.775988 -2.544129 -0.604283
C  -2.213998 2.225269 -0.330357
C  -1.535042 3.066066 -1.207031
C  -1.482122 1.454115 0.561315
C  0.461167 -2.369626 -0.187315
C  2.064684 -3.169156 -1.80774
C  -3.698986 2.130855 -0.419879
C  -0.567454 -2.846359 -0.988653
C  3.009335 -2.904585 1.471896
C  1.024759 -3.634701 -2.59943
C  -0.289248 -3.481541 -2.193971
C  -2.316092 -2.657278 0.615976
C  -3.303387 -1.73338 0.924806
C  -1.853183 -3.551712 1.573124
C  -3.826088 -1.6962 2.209679
C  -2.37914 -3.497387 2.855856
C  -3.362309 -2.572014 3.181533
H  4.589638 2.364527 -0.445539
H  2.447056 1.529496 1.534352
H  3.559626 4.291103 0.769665
H  5.205522 4.007838 1.315771
H  3.848988 3.479775 2.309213
H  4.868676 1.034692 2.297255
H  6.18711 1.763806 1.388145
H  5.379511 0.350974 0.748816
H  2.401826 2.945862 -1.033477
H  3.862178 -2.17024 -0.270802
H  0.424482 0.897328 1.294493
H  -2.07009 3.679355 -1.920964
H  -1.971817 0.786422 1.257483
H  0.245954 -1.873072 0.751544
H  3.091918 -3.290866 -2.126623
H  1.239272 -4.123561 -3.540486
H  -1.102846 -3.846892 -2.80787
H  -3.659587 -1.057739 0.158424
H  -1.096151 -4.286561 1.328784
H  -4.596396 -0.974757 2.450044
H  -2.01865 -4.192094 3.60366
H  -3.767458 -2.537835 4.184316
elementType: Cl F O N C H
totalener: -2099.13289588 hartree
nucrepener: 3981.53874649 hartree
electener: -6080.67164237 hartree
twoeener: 4716.56635135 hartree
cpcmener: -0.03724855 hartree
kineticenergy: 2091.78352612 hartree
xcener: -173.907776819778 hartree
chargesum: -0.0000000
charge: -0.096079 -0.184556 -0.186173 -0.190984 -0.268921 -0.412854 -0.326420 -0.215402 -0.084592 0.079781 0.084264 -0.292251 -0.303118 0.308471 0.240929 0.407067 -0.045181 -0.226624 0.033449 -0.091912 -0.121479 -0.173971 -0.255399 -0.197436 0.570960 0.292202 -0.229002 -0.112144 -0.239281 0.323888 -0.308398 -0.208231 -0.103525 -0.130115 -0.189632 0.062736 0.117573 0.091210 0.097140 0.087302 0.095950 0.095788 0.093641 0.150937 0.147863 0.136301 0.125159 0.168089 0.151029 0.144066 0.158829 0.148474 0.152942 0.154213 0.156029 0.159833 0.157567
qa: -0.0961 -0.1846 -0.1862 -0.1910 -0.2689 -0.4129 -0.3264 -0.2154 -0.0846 0.0798 0.0843 -0.2923 -0.3031 0.3085 0.2409 0.4071 -0.0452 -0.2266 0.0334 -0.0919 -0.1215 -0.1740 -0.2554 -0.1974 0.5710 0.2922 -0.2290 -0.1121 -0.2393 0.3239 -0.3084 -0.2082 -0.1035 -0.1301 -0.1896 0.0627 0.1176 0.0912 0.0971 0.0873 0.0959 0.0958 0.0936 0.1509 0.1479 0.1363 0.1252 0.1681 0.1510 0.1441 0.1588 0.1485 0.1529 0.1542 0.1560 0.1598 0.1576
va: 1.2341 1.1147 1.1123 1.0925 2.1300 2.1018 2.0848 3.1882 3.1088 3.8058 3.8771 3.9357 3.9495 4.1600 3.8260 3.7251 3.9331 3.9374 3.6196 3.6981 4.0794 4.0018 3.9568 3.9730 4.4009 3.7207 4.0828 3.9035 4.0122 3.6504 3.9585 3.9214 3.8620 3.8760 3.9303 1.0269 1.0137 1.0200 1.0052 1.0018 1.0033 1.0039 1.0090 1.0488 1.0126 1.0176 1.0273 0.9866 1.0059 1.0030 0.9894 1.0055 1.0237 0.9986 0.9943 0.9893 0.9903
dispcorr: -0.034885541 hartree
energy: -2099.167781418746
dipole: 36.48803 -34.52068 1.96735 -13.70365 14.09909 0.39544 17.11101 -16.92033 0.19068
magnitude: 2.01574 au
magnitude: 5.12360 debye
