program: Orca
programVersion: 5.0.2
elementType: Cl F F F O O O N N C C C C C C C C C C C C C C C C C C C C C C C C C C H H H H H H H H H H H H H H H H H H H H H H
charge: 0
multiplicity: 1
keywords: wb97x-d3
keywords: def2-TZVPP
keywords: def2/J RIJCOSX
keywords: DEFGRID2
keywords: scfconv7
keywords: smallprint printgap noloewdin
keywords: NOSOSCF
formula: C26H22ClF3N2O3
InChI: InChI=1/C26H22ClF3N2O3/c1-16(2)24(32-22-12-11-18(14-21(22)27)26(28,29)30)25(33)35-23(15-31)17-7-6-10-20(13-17)34-19-8-4-3-5-9-19/h3-14,16,23-24,32H,1-2H3
57 atoms
Cl -0.548914 1.997106 -2.169413
F  -3.021505 -0.409102 2.570449
F  -2.996012 1.522519 3.502516
F  -4.035319 1.244213 1.635211
O  2.614048 -0.364901 0.112028
O  4.525143 0.244272 1.099225
O  -2.017079 -2.625217 -0.007122
N  1.860934 2.097823 -0.480032
N  2.471664 -1.637659 3.243178
C  4.243386 2.498654 -0.901656
C  3.175515 1.951969 0.064996
C  4.294627 1.73472 -2.22322
C  4.048995 3.992807 -1.132179
C  3.53712 0.528177 0.486619
C  0.717073 1.817452 0.211984
C  2.726018 -1.680217 0.638305
C  -0.514427 1.731402 -0.454878
C  0.696707 1.61484 1.597364
C  1.618901 -2.50578 0.037056
C  -1.683737 1.24766 1.57772
C  -1.692442 1.446978 0.203597
C  -0.479304 1.336646 2.264094
C  0.293112 -2.147964 0.25771
C  1.924141 -3.622285 -0.725775
C  -2.936554 0.904761 2.316008
C  -0.715937 -2.927043 -0.280179
C  2.601289 -1.644876 2.102095
C  0.902741 -4.391305 -1.265872
C  -0.419611 -4.04745 -1.046402
C  -2.701027 -1.781491 -0.829158
C  -3.992563 -1.458205 -0.427438
C  -2.178866 -1.257863 -2.004119
C  -4.757893 -0.609227 -1.205563
C  -2.965076 -0.413699 -2.777592
C  -4.250947 -0.081015 -2.386736
H  5.2000 2.35473 -0.393481
H  3.256768 2.546935 0.982627
H  3.399165 1.884433 -2.830671
H  4.427471 0.660974 -2.084567
H  5.134072 2.0855 -2.823088
H  3.116495 4.207408 -1.654444
H  4.865261 4.393365 -1.733662
H  4.032647 4.54293 -0.190673
H  1.786105 2.008872 -1.479919
H  3.701696 -2.112874 0.395535
H  1.6098 1.671367 2.17429
H  -2.608982 1.382887 -0.367927
H  -0.440482 1.184752 3.334352
H  0.036409 -1.281686 0.857518
H  2.956874 -3.900394 -0.894992
H  1.140274 -5.264861 -1.857432
H  -1.224266 -4.646133 -1.452677
H  -4.381743 -1.86791 0.494567
H  -1.1711 -1.48929 -2.321468
H  -5.759102 -0.356274 -0.882943
H  -2.553692 -0.006898 -3.691279
H  -4.853123 0.581631 -2.993073
totalener: -2099.10224188 hartree
nucrepener: 4168.12137914 hartree
electener: -6267.22362103 hartree
twoeener: 4903.42865278 hartree
kineticenergy: 2091.87858877 hartree
xcener: -173.926995790175 hartree
chargesum: 0.0000000
charge: -0.098289 -0.172971 -0.175532 -0.175589 -0.244500 -0.317103 -0.286986 -0.232696 0.010061 0.013635 0.094103 -0.284218 -0.258438 0.251345 0.242825 0.305305 0.007648 -0.261926 0.026644 -0.102991 -0.139052 -0.102879 -0.108759 -0.115302 0.561623 0.103460 -0.266723 -0.124779 -0.115307 0.319934 -0.246540 -0.173383 -0.077534 -0.167922 -0.146639 0.066886 0.115822 0.071724 0.094656 0.099144 0.081973 0.092113 0.085557 0.137105 0.114808 0.117135 0.143618 0.127409 0.112824 0.114106 0.131395 0.132742 0.129123 0.118354 0.124839 0.125360 0.122780
qa: -0.0983 -0.1730 -0.1755 -0.1756 -0.2445 -0.3171 -0.2870 -0.2327 0.0101 0.0136 0.0941 -0.2842 -0.2584 0.2513 0.2428 0.3053 0.0076 -0.2619 0.0266 -0.1030 -0.1391 -0.1029 -0.1088 -0.1153 0.5616 0.1035 -0.2667 -0.1248 -0.1153 0.3199 -0.2465 -0.1734 -0.0775 -0.1679 -0.1466 0.0669 0.1158 0.0717 0.0947 0.0991 0.0820 0.0921 0.0856 0.1371 0.1148 0.1171 0.1436 0.1274 0.1128 0.1141 0.1314 0.1327 0.1291 0.1184 0.1248 0.1254 0.1228
va: 1.2339 1.1147 1.1281 1.1272 2.1440 2.1907 2.1119 3.1863 3.1047 3.8784 3.8584 3.9555 3.9395 4.2333 3.7756 3.8485 3.9361 3.9489 3.7011 3.7123 3.9803 4.0471 3.9984 3.9447 4.4227 3.9963 3.9778 3.9701 3.9988 3.6718 3.9692 3.8166 3.9088 3.9269 3.9380 1.0267 1.0030 1.0072 1.0123 1.0044 1.0182 1.0056 1.0080 1.0653 1.0193 1.0198 1.0075 1.0183 1.0297 1.0101 1.0007 1.0058 1.0234 1.0188 1.0000 1.0068 1.0016
dispcorr: -0.040586597 hartree
energy: -2099.142828479894
dipole: 31.40596 -30.38295 1.02301 3.35947 -3.21979 0.13968 -23.63036 21.27586 -2.35450
magnitude: 2.57094 au
magnitude: 6.53480 debye
