program: Orca
programVersion: 5.0.2
elementType: Cl F F F O O O N N C C C C C C C C C C C C C C C C C C C C C C C C C C H H H H H H H H H H H H H H H H H H H H H H
charge: 0
multiplicity: 1
keywords: wb97x-d3
keywords: def2-TZVPP
keywords: def2/J RIJCOSX
keywords: DEFGRID2
keywords: scfconv7
keywords: smallprint printgap noloewdin
keywords: NOSOSCF
formula: C26H22ClF3N2O3
InChI: InChI=1/C26H22ClF3N2O3/c1-16(2)24(32-22-12-11-18(14-21(22)27)26(28,29)30)25(33)35-23(15-31)17-7-6-10-20(13-17)34-19-8-4-3-5-9-19/h3-14,16,23-24,32H,1-2H3
57 atoms
Cl -0.999336 3.62135 -1.590987
F  -3.105303 -0.183908 2.957937
F  -3.92006 1.795433 2.711586
F  -4.163815 0.336109 1.156262
O  3.181581 -0.520824 0.126913
O  2.019305 -0.047505 -1.734235
O  -1.847614 -2.874759 -0.281938
N  1.497014 2.457878 -0.488391
N  5.009558 -3.124121 1.021439
C  3.837145 2.459247 -1.170347
C  2.749053 1.768191 -0.329226
C  4.049863 3.890922 -0.688898
C  5.15252 1.686458 -1.143173
C  2.597224 0.308017 -0.748945
C  0.358704 2.055603 0.1572
C  2.952991 -1.922774 -0.048064
C  -0.901845 2.532659 -0.243594
C  0.376584 1.175295 1.243797
C  1.653412 -2.308171 0.613273
C  -2.020952 1.243595 1.4409
C  -2.065908 2.137223 0.376561
C  -0.789857 0.778713 1.872194
C  0.520695 -2.450435 -0.174353
C  1.573456 -2.430912 1.995706
C  -3.300537 0.795741 2.06931
C  -0.707621 -2.696507 0.428241
C  4.108656 -2.587958 0.552996
C  0.347714 -2.699816 2.581924
C  -0.795593 -2.820545 1.808159
C  -2.087286 -2.156393 -1.422291
C  -1.722753 -0.82319 -1.554078
C  -2.773843 -2.805824 -2.437809
C  -2.047934 -0.144225 -2.717941
C  -3.100047 -2.111382 -3.592367
C  -2.736627 -0.78083 -3.740079
H  3.48045 2.480969 -2.207469
H  3.060578 1.808169 0.719564
H  4.435572 3.902532 0.332362
H  3.132836 4.477648 -0.702269
H  4.77888 4.398018 -1.321193
H  5.512945 1.544287 -0.123015
H  5.918314 2.239319 -1.686601
H  5.079697 0.705288 -1.612589
H  1.347771 2.853006 -1.403972
H  2.929544 -2.177725 -1.11172
H  1.310687 0.775968 1.612415
H  -3.009595 2.516563 0.007564
H  -0.715662 0.08257 2.694642
H  0.591626 -2.352352 -1.249871
H  2.459416 -2.333511 2.610455
H  0.277642 -2.80874 3.656004
H  -1.756629 -3.017693 2.264197
H  -1.188954 -0.31377 -0.763334
H  -3.054415 -3.843699 -2.314953
H  -1.7615 0.894629 -2.818006
H  -3.638289 -2.618562 -4.382346
H  -2.98991 -0.24362 -4.644026
totalener: -2099.10516600 hartree
nucrepener: 4139.90263833 hartree
electener: -6239.00780433 hartree
twoeener: 4874.59035803 hartree
kineticenergy: 2091.86302208 hartree
xcener: -173.922918197316 hartree
chargesum: 0.0000000
charge: -0.089913 -0.179328 -0.172704 -0.171499 -0.239401 -0.335887 -0.297492 -0.207887 0.003376 0.018866 0.060509 -0.255286 -0.274797 0.283709 0.238150 0.297911 -0.035019 -0.144451 0.020745 -0.046404 -0.157265 -0.199115 -0.165575 -0.196551 0.549085 0.288005 -0.258482 -0.113383 -0.221712 0.238058 -0.065439 -0.203435 -0.124913 -0.094988 -0.145566 0.056201 0.100735 0.078654 0.094482 0.090383 0.094989 0.088569 0.090487 0.132868 0.126938 0.112548 0.108933 0.144280 0.134845 0.123085 0.136595 0.132743 0.052703 0.124596 0.126118 0.123646 0.123680
qa: -0.0899 -0.1793 -0.1727 -0.1715 -0.2394 -0.3359 -0.2975 -0.2079 0.0034 0.0189 0.0605 -0.2553 -0.2748 0.2837 0.2382 0.2979 -0.0350 -0.1445 0.0207 -0.0464 -0.1573 -0.1991 -0.1656 -0.1966 0.5491 0.2880 -0.2585 -0.1134 -0.2217 0.2381 -0.0654 -0.2034 -0.1249 -0.0950 -0.1456 0.0562 0.1007 0.0787 0.0945 0.0904 0.0950 0.0886 0.0905 0.1329 0.1269 0.1125 0.1089 0.1443 0.1348 0.1231 0.1366 0.1327 0.0527 0.1246 0.1261 0.1236 0.1237
va: 1.2340 1.1224 1.1265 1.1273 2.1158 2.1615 2.1253 3.2032 3.1151 3.8683 3.8751 3.9294 3.9530 4.1096 3.8331 3.8545 3.8851 3.8887 3.6123 3.6588 4.0932 4.0221 3.9286 3.9715 4.4267 3.7968 4.0202 3.8796 3.9751 3.8375 3.8559 4.0197 3.9663 3.9446 3.9850 1.0237 1.0139 1.0045 1.0234 1.0077 1.0066 1.0052 1.0129 1.0642 1.0180 1.0278 1.0330 1.0133 1.0168 1.0166 0.9967 1.0161 1.0224 1.0142 1.0073 0.9991 1.0013
dispcorr: -0.040387972 hartree
energy: -2099.145553976662
dipole: 36.83708 -36.26427 0.57282 1.19950 -0.22161 0.97789 -15.21192 14.61555 -0.59637
magnitude: 1.28064 au
magnitude: 3.25514 debye
