program: Orca
programVersion: 5.0.2
elementType: Cl F F F O O O N N C C C C C C C C C C C C C C C C C C C C C C C C C C H H H H H H H H H H H H H H H H H H H H H H
charge: 0
multiplicity: 1
keywords: wb97x-d3
keywords: def2-TZVPP
keywords: def2/J RIJCOSX
keywords: DEFGRID2
keywords: scfconv7
keywords: smallprint printgap noloewdin
keywords: NOSOSCF
formula: C26H22ClF3N2O3
InChI: InChI=1/C26H22ClF3N2O3/c1-16(2)24(32-22-12-11-18(14-21(22)27)26(28,29)30)25(33)35-23(15-31)17-7-6-10-20(13-17)34-19-8-4-3-5-9-19/h3-14,16,23-24,32H,1-2H3
57 atoms
Cl -0.808148 3.547909 -1.659168
F  -3.002549 -0.022338 2.933674
F  -3.181339 2.060634 3.419722
F  -4.140896 1.2898 1.657534
O  3.1270 -0.754533 0.17756
O  1.981974 -0.335486 -1.707059
O  -2.054666 -2.780875 -0.090788
N  1.669674 2.286665 -0.610467
N  4.775445 -3.396729 1.266101
C  3.968549 2.057707 -1.398874
C  2.87727 1.518699 -0.458056
C  4.309453 3.501136 -1.043655
C  5.222208 1.188204 -1.360892
C  2.60011 0.047459 -0.757034
C  0.545631 2.022117 0.12571
C  2.797769 -2.146101 0.107004
C  -0.700712 2.555898 -0.239582
C  0.570527 1.229113 1.279505
C  1.474867 -2.3944 0.787788
C  -1.800402 1.489746 1.60499
C  -1.850599 2.296522 0.476424
C  -0.577063 0.970356 2.001863
C  0.334731 -2.508865 0.005958
C  1.385361 -2.428324 2.17481
C  -3.033727 1.205367 2.399426
C  -0.907326 -2.635129 0.617092
C  3.907415 -2.841279 0.759321
C  0.144111 -2.579306 2.770723
C  -1.004753 -2.668751 2.000888
C  -2.257891 -2.077697 -1.246831
C  -2.989821 -2.708558 -2.242296
C  -1.811896 -0.773513 -1.414858
C  -3.277007 -2.025862 -3.413858
C  -2.098054 -0.107336 -2.596225
C  -2.828957 -0.726313 -3.599277
H  3.566222 2.025293 -2.418626
H  3.245432 1.613816 0.56836
H  3.439339 4.155154 -1.0666
H  5.043862 3.899267 -1.744117
H  4.742683 3.561624 -0.043402
H  5.053598 0.18225 -1.745602
H  5.61608 1.097733 -0.347156
H  6.003262 1.633116 -1.976837
H  1.496475 2.61716 -1.54727
H  2.755764 -2.476354 -0.935051
H  1.495736 0.791522 1.625315
H  -2.784858 2.716287 0.13025
H  -0.501585 0.335146 2.873065
H  0.410997 -2.482749 -1.073422
H  2.275275 -2.354724 2.787182
H  0.066057 -2.618473 3.849061
H  -1.976554 -2.775207 2.463443
H  -3.334886 -3.722895 -2.090909
H  -1.248202 -0.275535 -0.63756
H  -3.850368 -2.518432 -4.187968
H  -1.747463 0.90804 -2.725931
H  -3.049757 -0.198972 -4.517277
totalener: -2099.10540098 hartree
nucrepener: 4132.24996487 hartree
electener: -6231.35536586 hartree
twoeener: 4866.90894850 hartree
kineticenergy: 2091.86724934 hartree
xcener: -173.922945599431 hartree
chargesum: 0.0000000
charge: -0.090607 -0.177255 -0.170200 -0.172930 -0.239012 -0.337365 -0.297375 -0.207258 0.003005 0.021811 0.057606 -0.255839 -0.276614 0.286274 0.241619 0.295106 -0.038428 -0.150068 0.024088 -0.020532 -0.149214 -0.213708 -0.156988 -0.194225 0.536350 0.273728 -0.257243 -0.125387 -0.203249 0.232168 -0.205866 -0.056971 -0.093918 -0.121813 -0.149892 0.056831 0.100469 0.094256 0.090474 0.078856 0.091437 0.095282 0.088684 0.133149 0.127173 0.112948 0.115246 0.135192 0.134628 0.123429 0.137710 0.130392 0.124867 0.044027 0.124253 0.127520 0.123380
qa: -0.0906 -0.1773 -0.1702 -0.1729 -0.2390 -0.3374 -0.2974 -0.2073 0.0030 0.0218 0.0576 -0.2558 -0.2766 0.2863 0.2416 0.2951 -0.0384 -0.1501 0.0241 -0.0205 -0.1492 -0.2137 -0.1570 -0.1942 0.5363 0.2737 -0.2572 -0.1254 -0.2032 0.2322 -0.2059 -0.0570 -0.0939 -0.1218 -0.1499 0.0568 0.1005 0.0943 0.0905 0.0789 0.0914 0.0953 0.0887 0.1331 0.1272 0.1129 0.1152 0.1352 0.1346 0.1234 0.1377 0.1304 0.1249 0.0440 0.1243 0.1275 0.1234
va: 1.2342 1.1173 1.1244 1.1313 2.1138 2.1601 2.1266 3.2024 3.1152 3.8651 3.8781 3.9308 3.9526 4.1071 3.8305 3.8525 3.8930 3.8862 3.6038 3.6374 4.0447 4.0980 3.9239 3.9680 4.4338 3.8101 4.0220 3.8843 3.9729 3.8458 4.0181 3.8536 3.9441 3.9570 3.9916 1.0244 1.0139 1.0233 1.0077 1.0044 1.0127 1.0063 1.0054 1.0636 1.0174 1.0280 1.0318 1.0162 1.0175 1.0165 0.9966 1.0176 1.0141 1.0392 0.9988 1.0106 1.0015
dispcorr: -0.040099268 hartree
energy: -2099.145500251398
dipole: 35.75334 -35.15182 0.60152 -2.67248 3.55564 0.88316 -18.23647 17.47462 -0.76185
magnitude: 1.31233 au
magnitude: 3.33568 debye
