program: Orca
programVersion: 5.0.2
elementType: Cl F F F O O O N N C C C C C C C C C C C C C C C C C C C C C C C C C C H H H H H H H H H H H H H H H H H H H H H H
charge: 0
multiplicity: 1
keywords: wb97x-d3
keywords: def2-TZVPP
keywords: def2/J RIJCOSX
keywords: DEFGRID2
keywords: scfconv7
keywords: smallprint printgap noloewdin
keywords: NOSOSCF
formula: C26H22ClF3N2O3
InChI: InChI=1/C26H22ClF3N2O3/c1-16(2)24(32-22-12-11-18(14-21(22)27)26(28,29)30)25(33)35-23(15-31)17-7-6-10-20(13-17)34-19-8-4-3-5-9-19/h3-14,16,23-24,32H,1-2H3
57 atoms
Cl -0.513582 3.066694 -2.263619
F  -3.593474 2.268913 2.44855
F  -3.952681 0.761292 0.963984
F  -2.917036 0.256885 2.785623
O  3.315915 -0.434615 0.617166
O  2.821154 -0.233461 -1.560221
O  -1.159535 -2.966191 -1.48596
N  1.905949 2.369702 -0.687128
N  4.439977 -2.889743 2.526176
C  4.323278 2.371549 -1.066034
C  3.151482 1.770551 -0.275648
C  4.416957 3.874888 -0.830301
C  5.635975 1.687518 -0.695899
C  3.079592 0.26179 -0.501582
C  0.721051 2.089282 -0.057211
C  3.069121 -1.844953 0.564725
C  -0.508405 2.373025 -0.676134
C  0.661496 1.536096 1.225378
C  1.592837 -2.125223 0.699923
C  -1.743878 1.520686 1.197023
C  -1.713862 2.09762 -0.066635
C  -0.544053 1.261154 1.838967
C  0.860613 -2.43412 -0.435958
C  0.955446 -1.989153 1.927511
C  -3.04997 1.203178 1.847965
C  -0.513746 -2.605582 -0.347058
C  3.84241 -2.418278 1.666331
C  -0.417049 -2.155038 2.002278
C  -1.161919 -2.454247 0.8720
C  -2.394655 -2.448361 -1.765248
C  -3.358957 -3.320513 -2.24653
C  -2.663469 -1.092412 -1.636242
C  -4.601726 -2.826895 -2.612665
C  -3.912553 -0.615093 -1.999954
C  -4.884664 -1.475015 -2.489307
H  4.13252 2.188639 -2.130031
H  3.323152 1.978861 0.783991
H  4.632359 4.093143 0.217618
H  3.497758 4.39546 -1.093622
H  5.22384 4.301193 -1.426771
H  5.840086 1.770476 0.373338
H  6.466046 2.156294 -1.223736
H  5.652048 0.629665 -0.959728
H  1.828929 2.519116 -1.682066
H  3.450245 -2.264222 -0.371161
H  1.569332 1.296583 1.758717
H  -2.628275 2.326382 -0.59765
H  -0.529555 0.820907 2.825326
H  1.343028 -2.531496 -1.399418
H  1.523018 -1.762314 2.821498
H  -0.920586 -2.054437 2.954201
H  -2.234572 -2.578413 0.945052
H  -3.128945 -4.373622 -2.339711
H  -1.904969 -0.413644 -1.267013
H  -5.353648 -3.506421 -2.991281
H  -4.12362 0.441782 -1.909034
H  -5.855648 -1.093008 -2.773484
totalener: -2099.10252773 hartree
nucrepener: 4087.00581771 hartree
electener: -6186.10834544 hartree
twoeener: 4821.72598017 hartree
kineticenergy: 2091.88049511 hartree
xcener: -173.921970152792 hartree
chargesum: 0.0000000
charge: -0.078435 -0.168890 -0.172524 -0.180853 -0.240494 -0.343471 -0.298677 -0.222486 0.002593 0.028203 0.067126 -0.257188 -0.277446 0.275771 0.202009 0.292805 0.049608 -0.180530 0.051662 -0.026881 -0.240606 -0.155339 -0.154926 -0.210898 0.549486 0.211610 -0.258455 -0.118275 -0.154333 0.208022 -0.185117 -0.117713 -0.104752 -0.124781 -0.133554 0.058183 0.096554 0.076922 0.094695 0.090983 0.092012 0.088465 0.094445 0.137246 0.126740 0.114509 0.121568 0.127944 0.119171 0.123270 0.139717 0.138806 0.125669 0.136237 0.125313 0.113952 0.125327
qa: -0.0784 -0.1689 -0.1725 -0.1809 -0.2405 -0.3435 -0.2987 -0.2225 0.0026 0.0282 0.0671 -0.2572 -0.2774 0.2758 0.2020 0.2928 0.0496 -0.1805 0.0517 -0.0269 -0.2406 -0.1553 -0.1549 -0.2109 0.5495 0.2116 -0.2585 -0.1183 -0.1543 0.2080 -0.1851 -0.1177 -0.1048 -0.1248 -0.1336 0.0582 0.0966 0.0769 0.0947 0.0910 0.0920 0.0885 0.0944 0.1372 0.1267 0.1145 0.1216 0.1279 0.1192 0.1233 0.1397 0.1388 0.1257 0.1362 0.1253 0.1140 0.1253
va: 1.2545 1.1272 1.1198 1.1167 2.1139 2.1605 2.1097 3.1926 3.1162 3.8591 3.8982 3.9343 3.9527 4.1690 3.8800 3.8520 3.8924 3.9020 3.5822 3.6332 4.0833 4.0503 4.0504 3.9635 4.4111 3.9043 4.0298 3.8925 3.9162 3.8602 4.0134 3.8985 3.9513 3.9602 3.9757 1.0269 1.0147 1.0047 1.0231 1.0074 1.0057 1.0048 1.0124 1.0627 1.0154 1.0257 1.0235 1.0131 1.0338 1.0162 1.0009 1.0048 1.0133 0.9892 0.9989 1.0079 1.0005
dispcorr: -0.038700842 hartree
energy: -2099.141228569475
dipole: 31.48690 -31.19904 0.28785 -0.08430 0.99316 0.90886 -10.58991 9.91141 -0.67851
magnitude: 1.17015 au
magnitude: 2.97430 debye
