program: Orca
programVersion: 5.0.2
elementType: Cl F F F O O O N N C C C C C C C C C C C C C C C C C C C C C C C C C C H H H H H H H H H H H H H H H H H H H H H H
charge: 0
multiplicity: 1
keywords: wb97x-d3
keywords: def2-TZVPP
keywords: def2/J RIJCOSX
keywords: DEFGRID2
keywords: scfconv7
keywords: smallprint printgap noloewdin
keywords: NOSOSCF
formula: C26H22ClF3N2O3
InChI: InChI=1/C26H22ClF3N2O3/c1-16(2)24(32-22-12-11-18(14-21(22)27)26(28,29)30)25(33)35-23(15-31)17-7-6-10-20(13-17)34-19-8-4-3-5-9-19/h3-14,16,23-24,32H,1-2H3
57 atoms
Cl -0.487011 1.402767 -2.319211
F  -2.916317 0.270495 2.847547
F  -2.986507 2.37146 3.284004
F  -3.995466 1.599924 1.546283
O  2.573428 -0.326047 0.090555
O  3.854346 0.500052 1.727257
O  -1.242778 -2.662948 -2.309882
N  1.900312 2.139021 -0.709942
N  0.917726 -1.162488 2.93156
C  4.290296 2.005701 -1.179921
C  3.191361 1.948823 -0.100526
C  4.280159 3.368343 -1.868251
C  5.67463 1.717545 -0.606816
C  3.264434 0.649058 0.697837
C  0.744308 2.004302 0.017602
C  2.385451 -1.541792 0.797723
C  -0.46643 1.662348 -0.602634
C  0.708011 2.200473 1.402009
C  1.689859 -2.500963 -0.133026
C  -1.644241 1.698086 1.482151
C  -1.638679 1.504326 0.107825
C  -0.46093 2.044296 2.11879
C  0.508152 -2.114034 -0.753674
C  2.23862 -3.750759 -0.372114
C  -2.886123 1.486161 2.285454
C  -0.121975 -2.994985 -1.619406
C  1.571527 -1.309003 1.998827
C  1.59922 -4.622749 -1.241597
C  0.420682 -4.252295 -1.862993
C  -2.281059 -2.007475 -1.710593
C  -2.624112 -2.191894 -0.377152
C  -3.043428 -1.183516 -2.526545
C  -3.743616 -1.54889 0.129739
C  -4.166619 -0.55857 -2.009231
C  -4.523014 -0.736264 -0.679943
H  4.061508 1.233686 -1.925269
H  3.394344 2.751822 0.61618
H  4.530733 4.160047 -1.159516
H  3.314118 3.613036 -2.306482
H  5.023362 3.393191 -2.665368
H  5.915308 2.398118 0.211267
H  6.429283 1.854374 -1.381227
H  5.780693 0.700701 -0.231606
H  1.833929 1.787919 -1.653256
H  3.345576 -1.955126 1.122742
H  1.60558 2.476401 1.938012
H  -2.536147 1.218591 -0.424197
H  -0.432957 2.193006 3.189283
H  0.083409 -1.135013 -0.565816
H  3.160713 -4.045411 0.112507
H  2.020799 -5.600208 -1.432561
H  -0.085099 -4.925614 -2.542157
H  -2.035928 -2.832914 0.266549
H  -2.757477 -1.045936 -3.560756
H  -4.008021 -1.693466 1.167815
H  -4.762216 0.077124 -2.651052
H  -5.398398 -0.245611 -0.2781
totalener: -2099.10227065 hartree
nucrepener: 4156.65148910 hartree
electener: -6255.75375975 hartree
twoeener: 4892.31805460 hartree
kineticenergy: 2091.87157347 hartree
xcener: -173.923231622777 hartree
chargesum: -0.0000000
charge: -0.093943 -0.171074 -0.176038 -0.179955 -0.255938 -0.307375 -0.293343 -0.216610 0.001822 -0.017903 0.085003 -0.251672 -0.263741 0.266760 0.142582 0.314282 0.007080 -0.184494 0.032438 -0.063426 -0.105514 -0.144247 -0.142301 -0.153359 0.553911 0.221948 -0.257640 -0.092717 -0.196149 0.286302 -0.135515 -0.265559 -0.148549 -0.061633 -0.165273 0.052988 0.107366 0.080101 0.094217 0.088832 0.092769 0.085974 0.090941 0.130457 0.113835 0.123839 0.146079 0.121445 0.083537 0.113503 0.129439 0.129778 0.131667 0.122831 0.135908 0.126136 0.130197
qa: -0.0939 -0.1711 -0.1760 -0.1800 -0.2559 -0.3074 -0.2933 -0.2166 0.0018 -0.0179 0.0850 -0.2517 -0.2637 0.2668 0.1426 0.3143 0.0071 -0.1845 0.0324 -0.0634 -0.1055 -0.1442 -0.1423 -0.1534 0.5539 0.2219 -0.2576 -0.0927 -0.1961 0.2863 -0.1355 -0.2656 -0.1485 -0.0616 -0.1653 0.0530 0.1074 0.0801 0.0942 0.0888 0.0928 0.0860 0.0909 0.1305 0.1138 0.1238 0.1461 0.1214 0.0835 0.1135 0.1294 0.1298 0.1317 0.1228 0.1359 0.1261 0.1302
va: 1.2365 1.1195 1.1288 1.1198 2.1563 2.1897 2.1206 3.1667 3.0940 3.9127 3.8549 3.9310 3.9558 4.1691 3.8721 3.8599 3.9339 3.9482 3.7466 3.7624 3.9163 4.0797 3.9678 3.9723 4.4244 3.8508 3.9517 3.9632 4.0345 3.7217 3.8853 3.9874 3.8949 3.8626 3.9045 1.0204 1.0052 1.0046 1.0221 1.0076 1.0088 1.0035 1.0116 1.0689 1.0197 1.0179 1.0048 1.0192 1.0471 1.0110 1.0002 1.0115 1.0049 1.0192 1.0105 0.9981 1.0057
dispcorr: -0.040189008 hartree
energy: -2099.142459659494
dipole: 36.45867 -34.91761 1.54106 -1.74329 1.49281 -0.25048 -17.05218 15.31290 -1.73928
magnitude: 2.33725 au
magnitude: 5.94081 debye
