program: Gaussian 09
title: 000067502
version: EM64L-G09RevD.01
frameworkgroup: C1[X(C6H4N2S)]
method: RPBEPBE
basis: SDD
operation: Freq
keyword: #pfreq=noraman
keyword: PBEPBE/SDD
title: #p freq=noraman PBEPBE/SDD
converged: NO NO NO NO
title: Mulliken charges:
elementType: S N N C C C C C C H H H H
charge: 0.514412 -0.404385 -0.404384 0.134467 0.134464 -0.284237 -0.284234 -0.201021 -0.201024 0.260884 0.260882 0.237088 0.237089
chargesum: 0.00000
title: Mulliken charges with hydrogens summed into heavy atoms:
elementType: S N N C C C C C C
charge: 0.514412 -0.404385 -0.404384 0.134467 0.134464 -0.023354 -0.023352 0.036067 0.036065
polarizability: 1.40874660e+02 4.01291387e-05 9.41051330e+01 -5.10018847e-09 1.21961089e-03 3.59199505e+01
1716.lowfreq: -18.6913 -0.0025 -0.0020 -0.0017 7.7907 10.8173 181.1489 227.1977 346.4309
frequency: 181.1479 227.1977 346.4298 397.5034 472.3129 493.8244 546.5624 554.6159 625.4299 626.3353 717.9269 756.6916 765.3376 782.1804 861.8823 879.4896 970.6437 990.0509 994.6234 1124.6273 1155.0196 1236.7899 1278.3975 1321.6763 1355.0200 1455.6031 1460.8360 1520.6758 1609.5335 3139.9012 3154.8738 3175.4839 3182.2127
redmass: 6.1805 5.2918 6.9561 4.6224 10.9075 4.4201 3.4878 8.7386 8.5303 9.4526 13.7407 4.6296 1.3091 6.6515 1.4891 6.7430 1.3295 2.2893 1.3161 1.5839 1.2147 1.8895 4.1451 2.1117 2.5370 3.7164 4.1243 6.6338 6.1371 1.0866 1.0899 1.0962 1.0998
irintensity: 2.9536 0.0000 6.1235 17.1979 0.2583 0.3527 0.0000 0.2965 3.2280 2.8981 23.6886 0.0000 107.0509 2.1364 0.0000 0.0223 1.7649 2.7070 0.0000 3.7596 2.8988 3.7617 2.3305 4.3395 3.7277 5.0247 0.9770 11.0716 0.3828 5.1802 7.2957 8.2579 14.2540
temp: 298.150 k
press: 1.00000 atm
elementType: 16 7 7 6 6 6 6 6 6 1 1 1 1
symmnumber: 1
zpe: 229448.8 jmol-1
zpe.correction: 0.087392 hartree
zpe.thermalcorrener: 0.093873 hartree
zpe.thermalcorrenthalpy: 0.094818 hartree
zpe.thermalcorrgfe: 0.056310 hartree
zpe.sumelectzpe: -737.942200 hartree
zpe.sumelectthermal: -737.935719 hartree
zpe.sumelectthermalent: -737.934775 hartree
zpe.sumelectthermalfe: -737.973282 hartree
dipole: -2.7430 0.0000 0.0000
dipole: 2.7430
quadrupole: -50.5802 -59.8405 -61.2365
quadrupole: -0.0001 0.0000 0.0000
quadrupole: 6.6389 -2.6214 -4.0174 -0.0001 0.0000 0.0000
hfenergy: -738.0295922 hartree
pointgroup: C01 [X(C6H4N2S1)]
dipole: 1.0791768 -0.0000055 0. debye
dipolederiv: -0.2122222 0.0000087 0. 0.0000009 0.2359688 0.0000005 0. 0.0000004 0.2529164 0.1004625 0.0149597 -0.0000003 -0.3442831 -0.168572 -0.0000031 0.0000085 -0.0000026 -0.2833256 0.1004771 -0.0149637 0.0000003 0.3442817 -0.1685873 -0.0000031 -0.0000085 -0.0000026 -0.2833252 -0.04342 0.0102262 -0.0000015 -0.1985897 -0.160437 0.0000056 0.0000032 0.0000052 0.1008243 -0.0434281 -0.0102343 0.0000015 0.1985828 -0.1604334 0.0000056 -0.0000032 0.0000052 0.1008246 0.063967 -0.0537119 0.0000011 -0.0660529 0.1302496 -0.0000038 0.0000009 -0.0000032 -0.1350082 0.0639813 0.0537105 -0.0000011 0.0660526 0.1302532 -0.0000038 -0.0000009 -0.0000032 -0.1350077 -0.0348743 -0.1259878 0.0000029 -0.2623975 0.0717042 -0.0000046 0.0000062 -0.0000048 -0.1442019 -0.0348696 0.1259909 -0.0000029 0.2624031 0.0716901 -0.0000046 -0.0000062 -0.0000048 -0.144203 0.0846324 -0.0226061 0.0000005 0.0351806 -0.0362822 0.0000035 -0.0000005 0.0000029 0.1750667 0.0846322 0.0226054 -0.0000005 -0.0351826 -0.0362847 0.0000035 0.0000005 0.0000029 0.1750659 -0.0646683 0.0925101 -0.000002 0.0770199 0.0453629 0.0000022 -0.0000024 0.0000023 0.1601865 -0.0646701 -0.0925078 0.000002 -0.0770158 0.0453678 0.0000022 0.0000024 0.0000023 0.1601872 unknown
polarizability: 140.8746601|-0.0003646|94.105133|0.|-0.0012196|35.9199505 unknown
InChI: InChI=1S/C6H4N2S/c1-2-4-6-5(3-1)7-9-8-6/h1-4H
charge 0 multiplicity 1
13 atoms
S  -2.690754 0.000008 0.0000
N  -1.511483 -1.332336 0.000031
N  -1.511458 1.332319 -0.000031
C  -0.278183 -0.738307 0.000015
C  -0.278176 0.738274 -0.000015
C  0.967792 -1.453509 0.000029
C  0.967815 1.453457 -0.000029
C  2.151336 -0.723878 0.000013
C  2.151349 0.72381 -0.000013
H  0.959485 -2.54704 0.000047
H  0.959519 2.546991 -0.000047
H  3.110967 -1.251916 0.000024
H  3.110991 1.251827 -0.000024
