program: Orca
programVersion: 5.0.2
elementType: Cl F F F O O O N N C C C C C C C C C C C C C C C C C C C C C C C C C C H H H H H H H H H H H H H H H H H H H H H H
charge: 0
multiplicity: 1
keywords: wb97x-d3
keywords: def2-TZVPP
keywords: def2/J RIJCOSX
keywords: DEFGRID2
keywords: scfconv7
keywords: smallprint printgap noloewdin
keywords: NOSOSCF
formula: C26H22ClF3N2O3
InChI: InChI=1/C26H22ClF3N2O3/c1-16(2)24(32-22-12-11-18(14-21(22)27)26(28,29)30)25(33)35-23(15-31)17-7-6-10-20(13-17)34-19-8-4-3-5-9-19/h3-14,16,23-24,32H,1-2H3
57 atoms
Cl 0.704884 4.731627 -0.713708
F  -4.459132 1.691183 -0.325215
F  -3.876241 2.709681 -2.131281
F  -3.592415 0.583575 -1.944848
O  2.698592 -0.982094 0.1659
O  2.71262 0.723553 -1.294363
O  -1.847481 -3.349705 -0.532893
N  1.7462 2.36954 0.769586
N  5.265712 -2.778157 -0.988628
C  3.921058 1.573251 1.620764
C  2.528991 1.203365 1.066423
C  4.758932 2.423701 0.669363
C  3.781098 2.252916 2.97931
C  2.657626 0.319635 -0.171487
C  0.4596 2.2368 0.308734
C  2.794139 -1.938432 -0.888551
C  -0.163697 3.261117 -0.417576
C  -0.301752 1.086575 0.549603
C  1.788639 -3.036486 -0.636834
C  -2.154471 1.95858 -0.711429
C  -1.438558 3.125508 -0.93187
C  -1.58054 0.952572 0.05271
C  0.441394 -2.694266 -0.690626
C  2.160647 -4.345008 -0.3662
C  -3.519138 1.744637 -1.279614
C  -0.521211 -3.663322 -0.460196
C  4.177468 -2.414257 -0.941557
C  1.18553 -5.309417 -0.154533
C  -0.156668 -4.974349 -0.190809
C  -2.412768 -2.622778 0.472455
C  -1.790914 -2.391469 1.694163
C  -3.68265 -2.112757 0.223161
C  -2.450062 -1.639619 2.658827
C  -4.325113 -1.368376 1.197502
C  -3.712401 -1.122721 2.419484
H  4.444555 0.623711 1.772112
H  2.03549 0.62249 1.850287
H  4.873966 1.974887 -0.31604
H  5.757858 2.558082 1.083962
H  4.345311 3.425647 0.53526
H  3.256529 3.205002 2.898396
H  4.763991 2.449561 3.407844
H  3.231813 1.630058 3.686225
H  2.26008 3.12321 0.340386
H  2.578681 -1.454692 -1.846667
H  0.099164 0.273058 1.138648
H  -1.853851 3.937268 -1.512445
H  -2.124721 0.043414 0.265638
H  0.132758 -1.679462 -0.918747
H  3.20514 -4.624522 -0.326904
H  1.478091 -6.330242 0.049709
H  -0.923268 -5.718588 -0.020456
H  -0.808408 -2.792221 1.905593
H  -4.152263 -2.295336 -0.734047
H  -1.96284 -1.46041 3.608242
H  -5.307397 -0.965194 0.992473
H  -4.212882 -0.530397 3.172707
totalener: -2099.10423664 hartree
nucrepener: 4007.75145285 hartree
electener: -6106.85568949 hartree
twoeener: 4742.42017931 hartree
kineticenergy: 2091.86306507 hartree
xcener: -173.921097949262 hartree
chargesum: 0.0000000
charge: -0.088215 -0.176737 -0.174801 -0.177537 -0.254799 -0.328069 -0.294239 -0.269269 0.004703 0.000790 0.169935 -0.283379 -0.258395 0.230835 0.224703 0.339729 -0.004333 -0.226537 -0.041914 -0.165165 -0.077813 -0.019638 -0.176370 -0.116576 0.561030 0.155663 -0.286828 -0.103588 -0.141230 0.271738 -0.191155 -0.183946 -0.134858 -0.111245 -0.132427 0.061168 0.106327 0.110212 0.096929 0.069846 0.089319 0.092152 0.080036 0.144682 0.141117 0.123439 0.124264 0.033194 0.155035 0.130987 0.133805 0.131347 0.127630 0.125619 0.126657 0.129345 0.126827
qa: -0.0882 -0.1767 -0.1748 -0.1775 -0.2548 -0.3281 -0.2942 -0.2693 0.0047 0.0008 0.1699 -0.2834 -0.2584 0.2308 0.2247 0.3397 -0.0043 -0.2265 -0.0419 -0.1652 -0.0778 -0.0196 -0.1764 -0.1166 0.5610 0.1557 -0.2868 -0.1036 -0.1412 0.2717 -0.1912 -0.1839 -0.1349 -0.1112 -0.1324 0.0612 0.1063 0.1102 0.0969 0.0698 0.0893 0.0922 0.0800 0.1447 0.1411 0.1234 0.1243 0.0332 0.1550 0.1310 0.1338 0.1313 0.1276 0.1256 0.1267 0.1293 0.1268
va: 1.2400 1.1156 1.1297 1.1181 2.1165 2.1651 2.1167 3.2249 3.1165 3.8991 3.8059 3.9607 3.9316 4.2555 3.8415 3.7699 3.9727 3.9253 3.8263 3.9037 3.9787 3.9793 3.9738 3.9418 4.4145 3.9120 4.0539 3.9611 4.0240 3.7327 3.8377 3.9320 3.9450 3.9066 3.9285 1.0205 1.0108 1.0135 1.0047 1.0057 1.0161 1.0057 1.0082 1.0602 1.0240 1.0110 1.0251 1.0191 0.9930 1.0218 1.0003 1.0082 1.0127 1.0197 1.0009 1.0047 1.0005
dispcorr: -0.036393070 hartree
energy: -2099.140629712042
dipole: 29.86809 -29.75615 0.11194 -14.26372 13.85610 -0.40762 25.41512 -24.00193 1.41320
magnitude: 1.47506 au
magnitude: 3.74931 debye
