program: Orca
programVersion: 5.0.2
elementType: Cl F F F O O O N N C C C C C C C C C C C C C C C C C C C C C C C C C C H H H H H H H H H H H H H H H H H H H H H H
charge: 0
multiplicity: 1
keywords: wb97x-d3
keywords: def2-TZVPP
keywords: def2/J RIJCOSX
keywords: DEFGRID2
keywords: scfconv7
keywords: smallprint printgap noloewdin
keywords: NOSOSCF
formula: C26H22ClF3N2O3
InChI: InChI=1/C26H22ClF3N2O3/c1-16(2)24(32-22-12-11-18(14-21(22)27)26(28,29)30)25(33)35-23(15-31)17-7-6-10-20(13-17)34-19-8-4-3-5-9-19/h3-14,16,23-24,32H,1-2H3
57 atoms
Cl -0.705775 2.540697 -2.648745
F  -4.012832 4.374269 2.318466
F  -4.512168 4.677744 0.241265
F  -4.964146 2.807271 1.202709
O  3.003861 -1.238694 0.526837
O  2.593545 -0.353535 -1.488298
O  -0.893306 -4.231553 -0.312338
N  0.901793 1.459648 -0.407634
N  5.310197 -3.279837 1.729513
C  2.782803 1.732457 1.185012
C  1.782625 0.768534 0.491118
C  3.468239 1.125868 2.403815
C  3.791067 2.313932 0.201624
C  2.489986 -0.316022 -0.297173
C  -0.253582 2.056645 -0.021026
C  3.645872 -2.357258 -0.060428
C  -1.13286 2.61186 -0.968813
C  -0.64658 2.156242 1.321614
C  2.662446 -3.42584 -0.494779
C  -2.709695 3.246352 0.724538
C  -2.333738 3.185499 -0.611767
C  -1.848444 2.729435 1.68228
C  1.327334 -3.338004 -0.144185
C  3.119589 -4.491198 -1.259188
C  -4.045454 3.783505 1.119024
C  0.431319 -4.296895 -0.603491
C  4.566315 -2.866309 0.958658
C  2.225792 -5.467201 -1.66813
C  0.878659 -5.372248 -1.3564
C  -1.480745 -2.996021 -0.210618
C  -1.335312 -2.04521 -1.213852
C  -2.255513 -2.731514 0.906501
C  -1.970261 -0.820569 -1.085702
C  -2.893408 -1.503284 1.017202
C  -2.749114 -0.5414 0.02941
H  2.157705 2.558165 1.540223
H  1.192862 0.264854 1.267232
H  3.982949 1.907529 2.963088
H  4.212367 0.375698 2.140039
H  2.753721 0.657301 3.082889
H  4.508032 1.56486 -0.141007
H  4.364969 3.10863 0.67828
H  3.30494 2.743342 -0.674253
H  1.076901 1.355681 -1.394447
H  4.241413 -2.04619 -0.926138
H  -0.007113 1.773203 2.104059
H  -2.970286 3.584331 -1.389772
H  -2.105036 2.77039 2.732057
H  0.963832 -2.531147 0.477052
H  4.164608 -4.56327 -1.534067
H  2.57738 -6.302639 -2.258327
H  0.173872 -6.118627 -1.697911
H  -0.734247 -2.25808 -2.088922
H  -2.360283 -3.484593 1.676352
H  -1.859095 -0.083163 -1.869407
H  -3.502076 -1.29724 1.887508
H  -3.243048 0.416222 0.125305
totalener: -2099.10363269 hartree
nucrepener: 3982.18646113 hartree
electener: -6081.29009382 hartree
twoeener: 4716.32301278 hartree
kineticenergy: 2091.84711162 hartree
xcener: -173.923205019260 hartree
chargesum: -0.0000000
charge: -0.087055 -0.174970 -0.174257 -0.172968 -0.260943 -0.335118 -0.297804 -0.169823 0.008701 -0.015980 0.103525 -0.252759 -0.274338 0.263266 0.237267 0.272644 -0.112768 -0.209796 0.092801 -0.143826 -0.040223 -0.141651 -0.146033 -0.214149 0.543822 0.199521 -0.254744 -0.079015 -0.196253 0.225291 -0.167983 -0.180114 -0.137902 -0.126295 -0.127204 0.065810 0.104882 0.097403 0.085731 0.084459 0.083158 0.097314 0.099300 0.148272 0.135252 0.107006 0.120361 0.125404 0.128040 0.116382 0.129593 0.130817 0.133833 0.127581 0.148523 0.127024 0.150988
qa: -0.0871 -0.1750 -0.1743 -0.1730 -0.2609 -0.3351 -0.2978 -0.1698 0.0087 -0.0160 0.1035 -0.2528 -0.2743 0.2633 0.2373 0.2726 -0.1128 -0.2098 0.0928 -0.1438 -0.0402 -0.1417 -0.1460 -0.2141 0.5438 0.1995 -0.2547 -0.0790 -0.1963 0.2253 -0.1680 -0.1801 -0.1379 -0.1263 -0.1272 0.0658 0.1049 0.0974 0.0857 0.0845 0.0832 0.0973 0.0993 0.1483 0.1353 0.1070 0.1204 0.1254 0.1280 0.1164 0.1296 0.1308 0.1338 0.1276 0.1485 0.1270 0.1510
va: 1.2398 1.1281 1.1303 1.1098 2.1194 2.1518 2.1187 3.1574 3.1162 3.8239 3.8313 3.9488 3.9465 4.2668 3.8065 3.8375 3.9436 3.9574 3.6542 3.7533 3.9549 4.0916 3.9122 4.0640 4.4410 3.8839 3.9763 3.9520 4.0429 3.7984 3.9136 4.0177 3.8695 3.9886 3.8941 1.0096 1.0204 1.0045 1.0119 1.0084 1.0076 1.0021 1.0192 1.0751 1.0142 1.0178 1.0281 1.0172 1.0191 1.0106 0.9986 1.0105 1.0071 1.0116 1.0035 1.0012 0.9943
dispcorr: -0.037441755 hartree
energy: -2099.141074447184
dipole: 35.21431 -34.65601 0.55830 -19.37586 19.31628 -0.05958 6.11161 -6.44185 -0.33025
magnitude: 0.65139 au
magnitude: 1.65571 debye
