program: Orca
programVersion: 5.0.2
elementType: Cl Cl F O O O N C C C C C C C C C C C C C C C C C C C C C C C C C C C C H H H H H H H H H H H H H H H H H H H H H H
charge: 0
multiplicity: 1
keywords: wb97x-d3
keywords: def2-TZVPP
keywords: def2/J RIJCOSX
keywords: DEFGRID2
keywords: scfconv7
keywords: smallprint printgap noloewdin
keywords: NOSOSCF
formula: C28H22Cl2FNO3
InChI: InChI=1/C28H22Cl2FNO3/c1-28(2)21(15-22(30)17-8-11-19(29)12-9-17)26(28)27(33)35-25(16-32)18-10-13-23(31)24(14-18)34-20-6-4-3-5-7-20/h3-15,21,25-26H,1-2H3
57 atoms
Cl 3.14716 2.400439 -2.020943
Cl 8.26616 4.526362 2.156085
F  -5.606319 -3.282109 -1.770882
O  -2.208765 1.089984 1.22885
O  -1.590948 1.293803 -0.910287
O  -3.797346 -3.614719 0.270704
N  -4.913599 1.600927 3.043076
C  0.737585 -0.51747 0.366696
C  1.242172 0.809813 -0.134918
C  0.035272 0.763937 0.774188
C  1.470921 -1.248811 1.462919
C  0.09829 -1.446294 -0.636478
C  2.469586 1.423545 0.380129
C  -1.296466 1.085813 0.239077
C  3.371698 2.120106 -0.312943
C  -3.563742 1.231621 0.835898
C  4.58798 2.711912 0.26657
C  -4.094233 0.009807 0.121235
C  5.244283 2.069386 1.3182
C  5.103187 3.924384 -0.191997
C  -4.303629 1.445183 2.080465
C  6.366739 2.624907 1.908225
C  6.226495 4.489614 0.388324
C  -3.668392 -1.259356 0.496261
C  -5.016995 0.165331 -0.900313
C  6.8522 3.833991 1.436232
C  -4.171888 -2.372556 -0.15051
C  -5.534385 -0.948009 -1.546092
C  -5.111907 -2.200459 -1.161991
C  -3.251974 -4.502563 -0.627893
C  -2.56834 -4.100655 -1.766756
C  -3.390535 -5.848742 -0.317712
C  -2.039105 -5.069576 -2.610502
C  -2.850587 -6.802147 -1.166875
C  -2.178995 -6.419219 -2.321139
H  1.020701 1.003604 -1.178004
H  0.187089 1.055247 1.807814
H  2.305357 -1.817992 1.049803
H  0.798473 -1.954846 1.952678
H  1.86398 -0.585923 2.232174
H  -0.387056 -0.924304 -1.458988
H  -0.644195 -2.08314 -0.151251
H  0.858566 -2.098731 -1.068729
H  2.657005 1.329024 1.443967
H  -3.708228 2.121734 0.214864
H  4.891168 1.111501 1.67661
H  4.624364 4.452124 -1.005685
H  -2.947983 -1.402338 1.29244
H  6.862498 2.1074 2.718036
H  6.605214 5.433932 0.021825
H  -5.339614 1.154323 -1.198105
H  -6.26087 -0.842715 -2.340739
H  -2.439079 -3.052025 -2.005784
H  -3.921127 -6.144497 0.578552
H  -1.51169 -4.758119 -3.502552
H  -2.965075 -7.850956 -0.92618
H  -1.7677 -7.166133 -2.986696
elementType: Cl F O N C H
totalener: -2380.99870053 hartree
nucrepener: 3698.71440939 hartree
electener: -6079.71310992 hartree
twoeener: 4536.65985513 hartree
cpcmener: -0.04517028 hartree
kineticenergy: 2373.47216369 hartree
xcener: -182.580216362233 hartree
chargesum: 0.0000000
charge: -0.114749 -0.095247 -0.209386 -0.282778 -0.451786 -0.333683 -0.100557 0.112590 0.007211 -0.070816 -0.273341 -0.282171 -0.153395 0.375467 0.035443 0.420297 0.084937 -0.004643 -0.210124 -0.172206 -0.225160 -0.144092 -0.162223 -0.222843 -0.164346 0.100445 0.161784 -0.159759 0.273658 0.310863 -0.202449 -0.254108 -0.167728 -0.125615 -0.187172 0.078319 0.103733 0.102329 0.101773 0.092071 0.099151 0.091342 0.108819 0.136687 0.149678 0.150116 0.138039 0.148630 0.143878 0.143861 0.151339 0.155573 0.158247 0.148968 0.162503 0.160774 0.161852
qa: -0.1147 -0.0952 -0.2094 -0.2828 -0.4518 -0.3337 -0.1006 0.1126 0.0072 -0.0708 -0.2733 -0.2822 -0.1534 0.3755 0.0354 0.4203 0.0849 -0.0046 -0.2101 -0.1722 -0.2252 -0.1441 -0.1622 -0.2228 -0.1643 0.1004 0.1618 -0.1598 0.2737 0.3109 -0.2024 -0.2541 -0.1677 -0.1256 -0.1872 0.0783 0.1037 0.1023 0.1018 0.0921 0.0992 0.0913 0.1088 0.1367 0.1497 0.1501 0.1380 0.1486 0.1439 0.1439 0.1513 0.1556 0.1582 0.1490 0.1625 0.1608 0.1619
va: 1.2181 1.2101 1.0802 2.1176 2.0531 2.0567 3.1099 3.7434 3.8946 3.8218 3.9052 3.8995 3.8445 4.2130 3.8739 3.6929 3.5967 3.6282 4.0049 3.9826 4.0824 3.9822 4.0217 3.9667 3.9571 3.8368 3.7710 3.9058 3.9580 3.6177 3.8696 4.0028 3.9214 3.8892 3.8985 1.0534 1.0310 1.0005 1.0016 1.0066 1.0136 1.0009 1.0023 1.0042 1.0138 1.0020 1.0219 1.0193 1.0059 1.0067 0.9989 0.9966 0.9984 1.0078 0.9898 0.9881 0.9887
dispcorr: -0.031165120 hartree
energy: -2381.029865646585
dipole: -9.45113 10.11449 0.66336 -25.76508 24.90876 -0.85632 -1.14254 0.61188 -0.53066
magnitude: 1.20620 au
magnitude: 3.06593 debye
