program: Orca
programVersion: 5.0.2
elementType: Cl Cl F O O O N C C C C C C C C C C C C C C C C C C C C C C C C C C C C H H H H H H H H H H H H H H H H H H H H H H
charge: 0
multiplicity: 1
keywords: wb97x-d3
keywords: def2-TZVPP
keywords: def2/J RIJCOSX
keywords: DEFGRID2
keywords: scfconv7
keywords: smallprint printgap noloewdin
keywords: NOSOSCF
formula: C28H22Cl2FNO3
InChI: InChI=1/C28H22Cl2FNO3/c1-28(2)21(15-22(30)17-8-11-19(29)12-9-17)26(28)27(33)35-25(16-32)18-10-13-23(31)24(14-18)34-20-6-4-3-5-7-20/h3-15,21,25-26H,1-2H3
57 atoms
Cl 2.392426 4.136401 -0.202453
Cl 8.497015 2.796307 2.791606
F  -6.694031 -2.161336 -2.02088
O  -1.727222 -0.367349 1.400821
O  -1.986639 1.406443 0.066833
O  -4.456868 -3.53525 -1.594694
N  -3.323754 -1.685331 3.970457
C  0.591436 0.267126 -1.309644
C  0.990709 1.368358 -0.37281
C  0.108114 0.235542 0.126892
C  1.585339 -0.804837 -1.685874
C  -0.354016 0.616382 -2.433467
C  2.342526 1.485649 0.181587
C  -1.285945 0.522388 0.491623
C  3.044606 2.609322 0.334293
C  -3.083279 -0.245841 1.802358
C  4.382719 2.681028 0.940644
C  -4.049273 -0.749979 0.756473
C  5.346772 3.57896 0.4823
C  4.716355 1.829507 1.994987
C  -3.195694 -1.053608 3.018119
C  6.612321 3.614874 1.04288
C  5.978537 1.855214 2.563869
C  -3.762129 -1.915758 0.057425
C  -5.229979 -0.062691 0.522604
C  6.919738 2.750037 2.081014
C  -4.654451 -2.385629 -0.891366
C  -6.138103 -0.542748 -0.409373
C  -5.837244 -1.690435 -1.109767
C  -3.213609 -3.778625 -2.13531
C  -2.479059 -2.778927 -2.758685
C  -2.74302 -5.081172 -2.076914
C  -1.252674 -3.098191 -3.323878
C  -1.517602 -5.386075 -2.653257
C  -0.76548 -4.397508 -3.272391
H  0.469065 2.303725 -0.53985
H  0.593479 -0.503516 0.753545
H  2.215737 -1.11725 -0.854563
H  2.236464 -0.454453 -2.488594
H  1.060345 -1.690298 -2.048403
H  0.219058 0.767563 -3.349656
H  -0.920845 1.526643 -2.253416
H  -1.061672 -0.192876 -2.618588
H  2.827085 0.57079 0.504358
H  -3.328273 0.786617 2.073497
H  5.123307 4.257866 -0.329518
H  3.978862 1.147577 2.397126
H  -2.847292 -2.464685 0.24773
H  7.348712 4.312649 0.668456
H  6.214618 1.192638 3.3852
H  -5.449486 0.846848 1.06617
H  -7.06411 -0.018036 -0.603269
H  -2.852178 -1.763571 -2.811282
H  -3.32976 -5.848212 -1.58809
H  -0.678058 -2.321729 -3.811886
H  -1.148828 -6.402202 -2.608216
H  0.191718 -4.637371 -3.715394
elementType: Cl F O N C H
totalener: -2380.99862453 hartree
nucrepener: 3726.14787704 hartree
electener: -6107.14650157 hartree
twoeener: 4563.69603121 hartree
cpcmener: -0.04505159 hartree
kineticenergy: 2373.48187412 hartree
xcener: -182.582570441865 hartree
chargesum: -0.0000000
charge: -0.114434 -0.095096 -0.210279 -0.288381 -0.464990 -0.340055 -0.100453 0.114563 0.009704 -0.066830 -0.272746 -0.282416 -0.163688 0.389412 0.036513 0.424646 0.085030 -0.009826 -0.176155 -0.207495 -0.222546 -0.162305 -0.147729 -0.143181 -0.178821 0.102853 0.157646 -0.162322 0.205484 0.262275 -0.159309 -0.241331 -0.181614 -0.125272 -0.178939 0.084147 0.098511 0.092273 0.101746 0.097747 0.105017 0.099920 0.088475 0.139827 0.146526 0.139796 0.151881 0.152625 0.144892 0.145761 0.151744 0.154291 0.165291 0.149727 0.174462 0.161450 0.161982
qa: -0.1144 -0.0951 -0.2103 -0.2884 -0.4650 -0.3401 -0.1005 0.1146 0.0097 -0.0668 -0.2727 -0.2824 -0.1637 0.3894 0.0365 0.4246 0.0850 -0.0098 -0.1762 -0.2075 -0.2225 -0.1623 -0.1477 -0.1432 -0.1788 0.1029 0.1576 -0.1623 0.2055 0.2623 -0.1593 -0.2413 -0.1816 -0.1253 -0.1789 0.0841 0.0985 0.0923 0.1017 0.0977 0.1050 0.0999 0.0885 0.1398 0.1465 0.1398 0.1519 0.1526 0.1449 0.1458 0.1517 0.1543 0.1653 0.1497 0.1745 0.1614 0.1620
va: 1.2180 1.2106 1.0815 2.1206 2.0427 2.0649 3.1109 3.6761 3.8721 3.8565 3.9203 3.9017 3.8502 4.1666 3.8903 3.7012 3.5825 3.6451 3.9831 4.0003 4.0874 4.0193 3.9830 3.9021 3.9392 3.8380 3.7392 3.8793 4.0661 3.7086 3.8614 4.0006 3.8759 3.8904 3.9029 1.0498 1.0352 1.0071 1.0001 1.0035 1.0001 1.0207 1.0034 1.0032 1.0170 1.0208 1.0006 1.0147 1.0065 1.0055 0.9995 0.9962 0.9926 1.0056 0.9784 0.9874 0.9901
dispcorr: -0.031470962 hartree
energy: -2381.030095487166
dipole: -5.05838 6.07502 1.01665 -16.60406 16.45539 -0.14867 -18.68754 17.36172 -1.32582
magnitude: 1.67734 au
magnitude: 4.26346 debye
