program: Orca
programVersion: 5.0.2
elementType: Cl Cl F O O O N C C C C C C C C C C C C C C C C C C C C C C C C C C C C H H H H H H H H H H H H H H H H H H H H H H
charge: 0
multiplicity: 1
keywords: wb97x-d3
keywords: def2-TZVPP
keywords: def2/J RIJCOSX
keywords: DEFGRID2
keywords: scfconv7
keywords: smallprint printgap noloewdin
keywords: NOSOSCF
formula: C28H22Cl2FNO3
InChI: InChI=1/C28H22Cl2FNO3/c1-28(2)21(15-22(30)17-8-11-19(29)12-9-17)26(28)27(33)35-25(16-32)18-10-13-23(31)24(14-18)34-20-6-4-3-5-7-20/h3-15,21,25-26H,1-2H3
57 atoms
Cl 1.792297 -0.832494 -0.621093
Cl 8.173856 1.353108 -2.137444
F  -3.659635 -4.590895 -0.988616
O  -2.425665 1.340735 -0.568214
O  -2.821293 3.502515 -0.938072
O  -2.993782 -3.335077 1.249981
N  -5.473777 1.943593 0.793599
C  -0.291568 2.607622 1.349081
C  0.255506 1.730664 0.255958
C  -0.696743 2.859447 -0.090634
C  0.57915 3.664951 1.982106
C  -1.262576 1.985934 2.324198
C  1.651017 1.812042 -0.185114
C  -2.070446 2.62918 -0.575394
C  2.42834 0.794797 -0.559887
C  -3.753133 0.993595 -0.936126
C  3.842117 0.914246 -0.948395
C  -3.807568 -0.510465 -0.949047
C  4.392015 0.119195 -1.954397
C  4.666083 1.843874 -0.312035
C  -4.703382 1.543904 0.038559
C  5.718128 0.25457 -2.327607
C  5.994118 1.990363 -0.677364
C  -3.436775 -1.202328 0.198598
C  -4.153719 -1.193677 -2.102671
C  6.51111 1.191445 -1.68463
C  -3.366183 -2.582535 0.180385
C  -4.124471 -2.582137 -2.114822
C  -3.720486 -3.256238 -0.984648
C  -2.058102 -2.833929 2.130024
C  -2.28552 -3.048718 3.479751
C  -0.911006 -2.183782 1.691822
C  -1.350582 -2.603364 4.404695
C  0.005358 -1.729207 2.628774
C  -0.208724 -1.935183 3.985671
H  -0.176247 0.737793 0.230838
H  -0.259829 3.7504 -0.527973
H  1.218377 4.179675 1.266256
H  1.217999 3.223195 2.748611
H  -0.042718 4.420788 2.464226
H  -0.718165 1.624051 3.198068
H  -1.810618 1.139491 1.914382
H  -1.987255 2.724948 2.670973
H  2.106043 2.795928 -0.21966
H  -4.011153 1.394676 -1.920752
H  3.785595 -0.614379 -2.468077
H  4.27873 2.450835 0.495756
H  -3.182851 -0.663687 1.104235
H  6.123361 -0.367604 -3.113781
H  6.618743 2.710098 -0.166196
H  -4.43686 -0.653589 -2.996283
H  -4.389978 -3.135268 -3.005941
H  -3.182434 -3.561381 3.803443
H  -0.730637 -2.026788 0.635771
H  -1.524932 -2.773845 5.458851
H  0.897358 -1.217683 2.291381
H  0.512604 -1.58132 4.709855
elementType: Cl F O N C H
totalener: -2380.99732554 hartree
nucrepener: 3880.93571896 hartree
electener: -6261.93304450 hartree
twoeener: 4718.25946930 hartree
cpcmener: -0.04694637 hartree
kineticenergy: 2373.47118218 hartree
xcener: -182.581535442354 hartree
chargesum: 0.0000000
charge: -0.123709 -0.095469 -0.209436 -0.259234 -0.460921 -0.335994 -0.094154 0.124040 0.064759 -0.114432 -0.281548 -0.276334 -0.168249 0.421873 0.072678 0.383075 0.071991 -0.010335 -0.177430 -0.210928 -0.219341 -0.163114 -0.150463 -0.214032 -0.176406 0.104365 0.207062 -0.154011 0.188383 0.285276 -0.256739 -0.179234 -0.112029 -0.123133 -0.202168 0.054176 0.104526 0.092473 0.101202 0.101613 0.102028 0.061650 0.112615 0.137116 0.136716 0.139633 0.152390 0.180302 0.145590 0.146532 0.153341 0.153936 0.149819 0.152256 0.161305 0.144643 0.161480
qa: -0.1237 -0.0955 -0.2094 -0.2592 -0.4609 -0.3360 -0.0942 0.1240 0.0648 -0.1144 -0.2815 -0.2763 -0.1682 0.4219 0.0727 0.3831 0.0720 -0.0103 -0.1774 -0.2109 -0.2193 -0.1631 -0.1505 -0.2140 -0.1764 0.1044 0.2071 -0.1540 0.1884 0.2853 -0.2567 -0.1792 -0.1120 -0.1231 -0.2022 0.0542 0.1045 0.0925 0.1012 0.1016 0.1020 0.0616 0.1126 0.1371 0.1367 0.1396 0.1524 0.1803 0.1456 0.1465 0.1533 0.1539 0.1498 0.1523 0.1613 0.1446 0.1615
va: 1.2169 1.2100 1.0826 2.1643 2.0387 2.0820 3.1051 3.6943 3.8265 3.9098 3.9175 3.9349 3.8312 4.1625 3.8181 3.7857 3.5936 3.7269 3.9830 4.0043 4.0226 4.0200 3.9867 3.9262 3.9084 3.8371 3.7433 3.8758 4.0760 3.7598 4.0125 3.8598 3.8717 3.8080 3.9528 1.0321 1.0256 1.0067 1.0001 1.0004 1.0007 1.0059 1.0061 1.0034 1.0164 1.0210 1.0011 0.9791 1.0065 1.0055 0.9984 0.9969 1.0059 0.9976 0.9868 1.0083 0.9901
dispcorr: -0.034217359 hartree
energy: -2381.031542895824
dipole: -9.90626 11.44428 1.53802 16.82362 -16.55487 0.26876 21.77002 -21.92990 -0.15988
magnitude: 1.56949 au
magnitude: 3.98933 debye
