program: Orca
programVersion: 5.0.2
elementType: Cl Cl F O O O N C C C C C C C C C C C C C C C C C C C C C C C C C C C C H H H H H H H H H H H H H H H H H H H H H H
charge: 0
multiplicity: 1
keywords: wb97x-d3
keywords: def2-TZVPP
keywords: def2/J RIJCOSX
keywords: DEFGRID2
keywords: scfconv7
keywords: smallprint printgap noloewdin
keywords: NOSOSCF
formula: C28H22Cl2FNO3
InChI: InChI=1/C28H22Cl2FNO3/c1-28(2)21(15-22(30)17-8-11-19(29)12-9-17)26(28)27(33)35-25(16-32)18-10-13-23(31)24(14-18)34-20-6-4-3-5-7-20/h3-15,21,25-26H,1-2H3
57 atoms
Cl 0.814875 0.254124 1.919828
Cl 7.431088 -0.7164 0.058397
F  -3.515903 -4.329355 -0.516971
O  -2.971201 1.870651 0.224723
O  -3.034346 1.484072 -1.97205
O  -1.416463 -2.905417 0.347976
N  -4.945222 1.604083 2.847691
C  -0.68109 3.834285 -0.464788
C  -0.188518 2.564654 0.153533
C  -1.101639 2.507278 -1.068907
C  0.242482 4.662586 -1.325752
C  -1.655797 4.677362 0.320617
C  1.19449 2.091265 0.023098
C  -2.449395 1.920169 -1.010609
C  1.757821 1.10008 0.717965
C  -4.183395 1.156363 0.387921
C  3.150242 0.644698 0.571242
C  -4.010724 -0.332003 0.176663
C  3.851003 0.8981 -0.611476
C  3.809194 -0.051496 1.583994
C  -4.597168 1.422853 1.766764
C  5.162856 0.491607 -0.772047
C  5.122175 -0.469915 1.434217
C  -2.784083 -0.930234 0.422203
C  -5.083801 -1.091502 -0.267988
C  5.792904 -0.19289 0.256358
C  -2.613638 -2.278775 0.162143
C  -4.932523 -2.453011 -0.478597
C  -3.694218 -3.027856 -0.279174
C  -0.321511 -2.482557 -0.371447
C  0.909811 -2.946523 0.073374
C  -0.407726 -1.664541 -1.490204
C  2.06146 -2.593542 -0.611476
C  0.758907 -1.312534 -2.159575
C  1.993689 -1.77459 -1.7316
H  -0.676131 2.301222 1.084351
H  -0.617787 2.277347 -2.011447
H  -0.339716 5.327432 -1.965366
H  0.876835 4.061895 -1.976154
H  0.888673 5.283331 -0.703035
H  -2.356626 5.182098 -0.346293
H  -1.1075 5.448018 0.864801
H  -2.228568 4.11278 1.052419
H  1.824854 2.593671 -0.700567
H  -4.969023 1.54016 -0.271926
H  3.370725 1.398674 -1.441001
H  3.310106 -0.27969 2.515109
H  -1.93815 -0.360024 0.787598
H  5.67943 0.69637 -1.699854
H  5.609512 -1.00604 2.236912
H  -6.041128 -0.623885 -0.459129
H  -5.760698 -3.05736 -0.82428
H  0.963204 -3.580179 0.949491
H  -1.35726 -1.296158 -1.855686
H  3.019006 -2.954706 -0.259465
H  0.689414 -0.672969 -3.029824
H  2.894857 -1.497287 -2.261074
elementType: Cl F O N C H
totalener: -2380.99409149 hartree
nucrepener: 4060.35553502 hartree
electener: -6441.34962651 hartree
twoeener: 4898.67251667 hartree
cpcmener: -0.04465455 hartree
kineticenergy: 2373.47529755 hartree
xcener: -182.589158294022 hartree
chargesum: 0.0000000
charge: -0.118057 -0.095374 -0.209407 -0.279548 -0.457558 -0.336507 -0.097961 0.104748 0.005722 -0.061074 -0.298402 -0.266397 -0.076633 0.387905 -0.015587 0.376553 0.107586 -0.016526 -0.257509 -0.178451 -0.221365 -0.133860 -0.167382 -0.143245 -0.173314 0.113986 0.183631 -0.169006 0.224257 0.312293 -0.250669 -0.165580 -0.139630 -0.211217 -0.141319 0.098943 0.105881 0.101452 0.092754 0.106601 0.103364 0.097665 0.093983 0.138054 0.153396 0.143629 0.136091 0.127370 0.145576 0.145176 0.152203 0.155838 0.142684 0.150662 0.155796 0.158915 0.158863
qa: -0.1181 -0.0954 -0.2094 -0.2795 -0.4576 -0.3365 -0.0980 0.1047 0.0057 -0.0611 -0.2984 -0.2664 -0.0766 0.3879 -0.0156 0.3766 0.1076 -0.0165 -0.2575 -0.1785 -0.2214 -0.1339 -0.1674 -0.1432 -0.1733 0.1140 0.1836 -0.1690 0.2243 0.3123 -0.2507 -0.1656 -0.1396 -0.2112 -0.1413 0.0989 0.1059 0.1015 0.0928 0.1066 0.1034 0.0977 0.0940 0.1381 0.1534 0.1436 0.1361 0.1274 0.1456 0.1452 0.1522 0.1558 0.1427 0.1507 0.1558 0.1589 0.1589
va: 1.2193 1.2103 1.0843 2.1160 2.0368 2.0800 3.1075 3.8370 3.7942 3.8302 3.9198 3.8980 3.7358 4.1389 3.7783 3.7189 3.4717 3.6700 4.0101 3.9621 4.0749 3.9669 4.0154 3.9347 3.9289 3.8306 3.6871 3.8715 4.0664 3.6398 3.9703 3.8098 3.8528 3.9025 3.8063 1.0365 1.0230 1.0006 1.0047 0.9987 1.0001 1.0001 1.0105 1.0013 1.0115 1.0046 1.0267 1.0261 1.0049 1.0070 0.9986 0.9954 1.0095 1.0077 0.9894 0.9943 0.9880
dispcorr: -0.039095638 hartree
energy: -2381.033187129804
dipole: -6.47008 6.91918 0.44910 27.71534 -25.70594 2.00940 -12.26760 10.61940 -1.64820
magnitude: 2.63741 au
magnitude: 6.70376 debye
