program: Gaussian 09
title: 000067500
version: EM64L-G09RevD.01
frameworkgroup: C1[X(C7H5NS)]
method: RPBEPBE
basis: SDD
operation: Freq
keyword: #pfreq=noraman
keyword: PBEPBE/SDD
title: #p freq=noraman PBEPBE/SDD
converged: NO NO NO NO
title: Mulliken charges:
elementType: S N C C C C C C C H H H H H
charge: 0.261522 -0.012470 0.453281 -0.242505 -0.242492 -0.199624 -0.459390 -0.503145 -0.326097 0.258135 0.247028 0.254302 0.267084 0.244373
chargesum: 0.00000
title: Mulliken charges with hydrogens summed into heavy atoms:
elementType: S N C C C C C C C
charge: 0.261522 -0.012470 0.453281 -0.242505 0.015643 0.047404 -0.205088 -0.236061 -0.081725
polarizability: 1.33543570e+02 -3.28524012e+00 1.01099963e+02 3.71375805e-04 1.33487158e-04 3.65461549e+01
1716.lowfreq: -0.0012 -0.0008 -0.0006 3.2993 9.3175 10.3240 187.4275 196.9849 329.2515
frequency: 187.4271 196.9837 329.2514 393.0117 470.3600 472.1950 529.3204 585.3637 650.8289 683.0730 715.6050 756.4091 773.7549 825.6837 854.2530 894.6451 926.4431 953.5448 1009.9762 1060.2982 1090.5278 1179.6423 1214.3857 1265.8802 1317.9238 1331.9976 1400.2987 1437.6091 1498.8482 1539.9690 1564.9180 3122.0300 3142.5136 3168.0935 3178.0047 3235.0576
redmass: 5.7708 4.5773 6.2688 2.8427 8.9269 4.1106 7.3641 4.0838 8.1795 7.7416 1.6603 6.4078 1.9725 1.3749 4.7594 1.2838 1.5034 1.4287 2.3506 3.7196 1.2731 1.6082 1.6550 1.7478 4.0571 2.0380 2.1380 2.7063 4.7874 6.8577 7.3313 1.0915 1.0887 1.0978 1.0920 1.1002
irintensity: 1.7319 0.9140 1.6714 4.0595 0.2384 14.9636 0.3499 0.0054 2.4440 9.3365 69.9104 12.6949 7.3854 53.7601 11.9095 0.6973 12.4337 0.5778 1.1427 8.1683 13.5562 2.0621 5.1486 11.4952 5.2139 0.9614 18.0719 32.9538 11.9357 1.0795 15.7335 17.2940 6.4521 16.4120 2.6391 1.0412
temp: 298.150 k
press: 1.00000 atm
elementType: 16 7 6 6 6 6 6 6 6 1 1 1 1 1
symmnumber: 1
zpe: 262916.0 jmol-1
zpe.correction: 0.100139 hartree
zpe.thermalcorrener: 0.106689 hartree
zpe.thermalcorrenthalpy: 0.107634 hartree
zpe.thermalcorrgfe: 0.068968 hartree
zpe.sumelectzpe: -721.926034 hartree
zpe.sumelectthermal: -721.919484 hartree
zpe.sumelectthermalent: -721.918540 hartree
zpe.sumelectthermalfe: -721.957205 hartree
dipole: -2.3924 -0.0837 0.0000
dipole: 2.3938
quadrupole: -61.8553 -50.9278 -63.2464
quadrupole: -6.8945 0.0000 -0.0002
quadrupole: -3.1788 7.7487 -4.5699 -6.8945 0.0000 -0.0002
hfenergy: -722.0261736 hartree
pointgroup: C01 [X(C7H5N1S1)]
dipole: 0.9277868 0.1618927 0.0000038 debye
dipolederiv: -0.2694479 0.0674747 -0.0000021 -0.1437351 -0.197423 0.0000003 -0.0000085 0.0000009 0.1102552 -0.4034586 0.030054 0.0000065 -0.0151107 -0.3610805 -0.0000069 0.0000032 -0.000003 -0.2474718 0.01655 -0.0889938 0.0000038 -0.2787683 -0.3197468 0.0000019 0.0000026 -0.0000033 0.0976431 0.5475115 0.1799072 0.0000039 0.3100308 0.0263561 -0.0000001 0.000002 0.0000063 -0.1153058 -0.1320299 -0.1571421 0.0000018 -0.0880537 -0.1084345 0.0000024 -0.0000012 -0.0000001 -0.1554739 -0.3208269 0.0024538 -0.0000008 -0.1565963 0.0430435 0.0000038 0.0000121 0.0000044 -0.0796346 0.2306323 0.0890326 -0.0000106 -0.0050962 0.3408453 0.0000027 -0.0000019 0.0000107 -0.0730752 -0.1423891 -0.0934266 0.0000017 0.0435587 0.4712553 -0.0000027 -0.000006 -0.0000064 -0.2951061 0.2653246 -0.1386682 -0.0000109 0.1181661 0.2157689 0.0000044 -0.0000247 0.0000035 -0.1086355 0.0958148 -0.0168894 0.0000009 0.0633305 -0.043804 -0.000001 0.0000013 -0.0000002 0.1961605 0.0987188 -0.0278777 0.0000013 0.0339574 -0.0643294 -0.0000012 0.0000011 -0.000004 0.1678052 0.0708057 0.0215939 0. 0.0083204 -0.1003337 -0.000001 0.0000022 -0.0000054 0.1362536 0.0047242 0.025575 -0.0000008 0.0346966 0.0713987 -0.0000003 0.000005 0.0000017 0.2169558 -0.0619293 0.1069067 0.0000054 0.0752997 0.0264841 -0.0000022 0.0000126 -0.0000052 0.1496294 unknown
polarizability: 133.8254077|1.2528091|100.8181252|-0.0003495|-0.0001832|36.5461549 unknown
InChI: InChI=1S/C7H5NS/c1-3-8-5-6-2-4-9-7(1)6/h1-5H
charge 0 multiplicity 1
14 atoms
S  1.895181 1.423118 -0.000037
N  -2.213831 -0.697946 0.000001
C  0.232183 -0.685144 -0.000026
C  0.214779 0.7484 -0.000055
C  1.577073 -1.231252 -0.000037
C  -1.006645 1.449961 -0.000032
C  -1.024798 -1.353444 -0.000007
C  2.555785 -0.262944 -0.000022
C  -2.189161 0.67735 -0.000013
H  1.793494 -2.302205 -0.000043
H  -1.057288 2.54261 -0.000018
H  -1.072627 -2.449382 -0.000019
H  3.636956 -0.393843 -0.000018
H  -3.168299 1.168121 0.000025
