program: Orca
programVersion: 5.0.2
elementType: Cl Cl F O O O N C C C C C C C C C C C C C C C C C C C C C C C C C C C C H H H H H H H H H H H H H H H H H H H H H H
charge: 0
multiplicity: 1
keywords: wb97x-d3
keywords: def2-TZVPP
keywords: def2/J RIJCOSX
keywords: DEFGRID2
keywords: scfconv7
keywords: smallprint printgap noloewdin
keywords: NOSOSCF
formula: C28H22Cl2FNO3
InChI: InChI=1/C28H22Cl2FNO3/c1-28(2)21(15-22(30)17-8-11-19(29)12-9-17)26(28)27(33)35-25(16-32)18-10-13-23(31)24(14-18)34-20-6-4-3-5-7-20/h3-15,21,25-26H,1-2H3
57 atoms
Cl 0.964873 0.725658 2.261528
Cl 7.413308 -0.77905 0.202659
F  -3.445202 -4.325981 -0.413633
O  -3.013413 1.880008 0.149753
O  -3.195566 1.437517 -2.030369
O  -1.341375 -2.824744 0.311125
N  -4.81734 1.697223 2.895342
C  -0.655638 3.691689 -0.683508
C  -0.228579 2.404236 -0.039206
C  -1.171682 2.378069 -1.233908
C  0.300873 4.437799 -1.582565
C  -1.551002 4.613026 0.109445
C  1.121589 1.84899 -0.163101
C  -2.54918 1.867795 -1.110156
C  1.769317 1.140577 0.765536
C  -4.204731 1.160587 0.413222
C  3.155812 0.664518 0.65124
C  -4.01341 -0.33147 0.243734
C  3.594404 -0.490016 1.29983
C  4.07465 1.369808 -0.129399
C  -4.536217 1.477514 1.803904
C  4.896701 -0.939723 1.162624
C  5.377845 0.928108 -0.279637
C  -2.760394 -0.8944 0.438307
C  -5.086466 -1.128139 -0.128522
C  5.781245 -0.228151 0.369359
C  -2.564544 -2.241502 0.189272
C  -4.908241 -2.488941 -0.322094
C  -3.645611 -3.027154 -0.182173
C  -0.315571 -2.399116 -0.493646
C  -0.498827 -1.609997 -1.622475
C  0.954568 -2.831797 -0.132909
C  0.608921 -1.245881 -2.378696
C  2.045196 -2.472008 -0.908268
C  1.881884 -1.669869 -2.030086
H  -0.70937 2.214161 0.911933
H  -0.733866 2.092817 -2.183914
H  0.882279 3.782607 -2.230088
H  1.00007 5.029929 -0.989203
H  -0.249195 5.124889 -2.227913
H  -2.155457 4.100307 0.854104
H  -2.223092 5.164113 -0.55113
H  -0.939319 5.345075 0.639941
H  1.651178 2.022412 -1.092842
H  -5.032778 1.506774 -0.214588
H  2.91796 -1.06579 1.916164
H  3.785964 2.293683 -0.613036
H  -1.913161 -0.297532 0.755246
H  5.211112 -1.841221 1.670996
H  6.073148 1.495131 -0.883795
H  -6.065546 -0.691619 -0.279579
H  -5.736613 -3.121207 -0.613379
H  -1.480676 -1.272877 -1.92819
H  1.083444 -3.451777 0.745486
H  0.463241 -0.627066 -3.254899
H  3.031294 -2.817624 -0.627741
H  2.738156 -1.380815 -2.624878
elementType: Cl F O N C H
totalener: -2381.01022823 hartree
nucrepener: 4050.45755114 hartree
electener: -6431.46777938 hartree
twoeener: 4888.51090504 hartree
cpcmener: -0.03832325 hartree
kineticenergy: 2373.49318990 hartree
xcener: -182.589170368930 hartree
chargesum: -0.0000000
charge: -0.117134 -0.092115 -0.206285 -0.280273 -0.424911 -0.325871 -0.083433 0.069974 0.096018 -0.068006 -0.281441 -0.266127 -0.208977 0.359899 0.046466 0.361820 0.111248 0.000944 -0.207560 -0.200551 -0.226664 -0.167220 -0.149601 -0.149996 -0.176093 0.117196 0.168177 -0.165596 0.226043 0.343572 -0.199087 -0.277933 -0.160107 -0.081397 -0.210668 0.088939 0.102109 0.091380 0.102523 0.101343 0.094884 0.101220 0.097041 0.129627 0.149428 0.136242 0.144623 0.141698 0.143979 0.142226 0.148326 0.152922 0.148805 0.142376 0.157592 0.155320 0.153083
qa: -0.1171 -0.0921 -0.2063 -0.2803 -0.4249 -0.3259 -0.0834 0.0700 0.0960 -0.0680 -0.2814 -0.2661 -0.2090 0.3599 0.0465 0.3618 0.1112 0.0009 -0.2076 -0.2006 -0.2267 -0.1672 -0.1496 -0.1500 -0.1761 0.1172 0.1682 -0.1656 0.2260 0.3436 -0.1991 -0.2779 -0.1601 -0.0814 -0.2107 0.0889 0.1021 0.0914 0.1025 0.1013 0.0949 0.1012 0.0970 0.1296 0.1494 0.1362 0.1446 0.1417 0.1440 0.1422 0.1483 0.1529 0.1488 0.1424 0.1576 0.1553 0.1531
va: 1.2122 1.2144 1.0890 2.1068 2.0746 2.0980 3.1088 3.8226 3.7198 3.8224 3.9163 3.9076 3.8082 4.1754 3.8199 3.7476 3.4677 3.6388 3.9563 4.0062 4.0663 4.0095 3.9928 3.9528 3.9466 3.8382 3.7223 3.8736 4.0698 3.6316 3.8248 3.9772 3.8594 3.8187 3.8763 1.0399 1.0238 1.0057 0.9999 1.0010 1.0113 1.0002 1.0001 1.0066 1.0115 1.0249 1.0047 1.0059 1.0068 1.0069 0.9996 0.9965 1.0110 1.0117 0.9925 0.9865 0.9939
dispcorr: -0.038782157 hartree
energy: -2381.049010390166
dipole: -6.93761 7.23864 0.30103 25.59802 -24.04917 1.54885 -15.30389 13.48857 -1.81532
magnitude: 2.40519 au
magnitude: 6.11350 debye
