program: Orca
programVersion: 5.0.2
elementType: Cl Cl F O O O N C C C C C C C C C C C C C C C C C C C C C C C C C C C C H H H H H H H H H H H H H H H H H H H H H H
charge: 0
multiplicity: 1
keywords: wb97x-d3
keywords: def2-TZVPP
keywords: def2/J RIJCOSX
keywords: DEFGRID2
keywords: scfconv7
keywords: smallprint printgap noloewdin
keywords: NOSOSCF
formula: C28H22Cl2FNO3
InChI: InChI=1/C28H22Cl2FNO3/c1-28(2)21(15-22(30)17-8-11-19(29)12-9-17)26(28)27(33)35-25(16-32)18-10-13-23(31)24(14-18)34-20-6-4-3-5-7-20/h3-15,21,25-26H,1-2H3
57 atoms
Cl 2.316628 4.599229 1.711757
Cl 9.002366 2.736726 1.618218
F  -6.641055 -1.814393 -2.082828
O  -1.199109 -0.522095 0.740175
O  -1.860959 1.603915 0.950353
O  -4.492311 -3.344324 -2.326418
N  -1.724539 -3.179299 2.639365
C  0.24428 2.122202 -1.303791
C  0.891881 2.40743 0.019556
C  0.174974 1.082302 -0.203423
C  1.095897 1.754128 -2.495166
C  -0.968037 2.938014 -1.681446
C  2.346158 2.384384 0.207947
C  -1.061432 0.801532 0.543479
C  3.076253 3.239532 0.926468
C  -2.369353 -0.957939 1.425116
C  4.531166 3.134548 1.120748
C  -3.519787 -1.182612 0.477033
C  5.341976 4.264578 1.231693
C  5.136113 1.877932 1.187513
C  -1.991636 -2.204257 2.094774
C  6.713848 4.148655 1.380718
C  6.50676 1.748598 1.332291
C  -3.436726 -2.18603 -0.483819
C  -4.644321 -0.374899 0.552055
C  7.288999 2.888752 1.426549
C  -4.495561 -2.40461 -1.348221
C  -5.702756 -0.578215 -0.32155
C  -5.621198 -1.591526 -1.24996
C  -3.907883 -4.565611 -2.096389
C  -4.116529 -5.26618 -0.915412
C  -3.142076 -5.103555 -3.119438
C  -3.535917 -6.516662 -0.762406
C  -2.577622 -6.361168 -2.956225
C  -2.766324 -7.069422 -1.777783
H  0.348576 3.112454 0.638638
H  0.813369 0.218579 -0.351467
H  1.52471 2.649264 -2.948819
H  0.485475 1.259617 -3.252673
H  1.914729 1.079682 -2.247967
H  -0.652974 3.788055 -2.288292
H  -1.507119 3.334686 -0.825246
H  -1.665771 2.349785 -2.279856
H  2.893796 1.589725 -0.286205
H  -2.660174 -0.246126 2.202917
H  4.911886 5.25636 1.192222
H  4.533435 0.980017 1.147978
H  -2.552175 -2.809243 -0.554171
H  7.324308 5.038233 1.458036
H  6.952845 0.764698 1.386491
H  -4.706531 0.410387 1.293836
H  -6.590755 0.038631 -0.273284
H  -4.725187 -4.850549 -0.121627
H  -2.993509 -4.545458 -4.035637
H  -3.694309 -7.063794 0.158075
H  -1.981252 -6.783018 -3.755158
H  -2.318617 -8.046274 -1.651042
elementType: Cl F O N C H
totalener: -2381.01606030 hartree
nucrepener: 3610.82455405 hartree
electener: -5991.84061435 hartree
twoeener: 4449.02215606 hartree
cpcmener: -0.03600761 hartree
kineticenergy: 2373.47479469 hartree
xcener: -182.578760292749 hartree
chargesum: 0.0000000
charge: -0.110644 -0.092582 -0.206226 -0.285985 -0.447427 -0.325538 -0.089118 0.095910 0.020375 -0.094584 -0.266081 -0.274740 -0.156558 0.399507 0.032969 0.425376 0.085819 -0.011929 -0.171969 -0.207941 -0.232645 -0.159117 -0.143440 -0.164551 -0.155358 0.099984 0.160684 -0.165306 0.203379 0.263912 -0.174724 -0.237584 -0.146326 -0.124979 -0.177873 0.084331 0.095412 0.100728 0.100460 0.088775 0.098345 0.095603 0.101114 0.132124 0.134925 0.137321 0.149247 0.149690 0.143478 0.142774 0.147861 0.151488 0.157893 0.147347 0.159300 0.158664 0.158431
qa: -0.1106 -0.0926 -0.2062 -0.2860 -0.4474 -0.3255 -0.0891 0.0959 0.0204 -0.0946 -0.2661 -0.2747 -0.1566 0.3995 0.0330 0.4254 0.0858 -0.0119 -0.1720 -0.2079 -0.2326 -0.1591 -0.1434 -0.1646 -0.1554 0.1000 0.1607 -0.1653 0.2034 0.2639 -0.1747 -0.2376 -0.1463 -0.1250 -0.1779 0.0843 0.0954 0.1007 0.1005 0.0888 0.0983 0.0956 0.1011 0.1321 0.1349 0.1373 0.1492 0.1497 0.1435 0.1428 0.1479 0.1515 0.1579 0.1473 0.1593 0.1587 0.1584
va: 1.2224 1.2128 1.0872 2.1320 2.0663 2.0819 3.1087 3.7168 3.8462 3.8731 3.9147 3.9045 3.8454 4.1790 3.9044 3.7245 3.5946 3.6534 3.9872 4.0059 4.0742 4.0210 3.9875 3.9462 3.9019 3.8522 3.7603 3.8950 4.0619 3.7088 3.9009 4.0048 3.8953 3.8867 3.9024 1.0481 1.0356 1.0008 1.0010 1.0060 1.0001 1.0183 0.9989 1.0059 1.0195 1.0219 1.0010 1.0103 1.0068 1.0065 1.0064 0.9979 0.9956 1.0064 0.9903 0.9888 0.9901
dispcorr: -0.028337632 hartree
energy: -2381.044397933067
dipole: -13.22160 13.30916 0.08756 -10.65197 10.89520 0.24323 -17.25135 16.01198 -1.23937
magnitude: 1.26605 au
magnitude: 3.21804 debye
