program: Orca
programVersion: 5.0.2
elementType: Cl Cl F O O O N C C C C C C C C C C C C C C C C C C C C C C C C C C C C H H H H H H H H H H H H H H H H H H H H H H
charge: 0
multiplicity: 1
keywords: wb97x-d3
keywords: def2-TZVPP
keywords: def2/J RIJCOSX
keywords: DEFGRID2
keywords: scfconv7
keywords: smallprint printgap noloewdin
keywords: NOSOSCF
formula: C28H22Cl2FNO3
InChI: InChI=1/C28H22Cl2FNO3/c1-28(2)21(15-22(30)17-8-11-19(29)12-9-17)26(28)27(33)35-25(16-32)18-10-13-23(31)24(14-18)34-20-6-4-3-5-7-20/h3-15,21,25-26H,1-2H3
57 atoms
Cl 3.161252 2.345382 -2.035636
Cl 8.294021 4.49891 2.104746
F  -5.690195 -3.244524 -1.846027
O  -2.230216 1.015645 1.240245
O  -1.607363 1.201274 -0.89725
O  -3.978512 -3.646708 0.247443
N  -4.933001 1.584189 3.048339
C  0.774241 -0.524771 0.381475
C  1.226834 0.823708 -0.112833
C  0.023862 0.725909 0.797869
C  1.549898 -1.227444 1.468389
C  0.168459 -1.476742 -0.620061
C  2.445933 1.462152 0.393575
C  -1.315316 1.012824 0.254447
C  3.361962 2.122005 -0.316584
C  -3.582082 1.188006 0.84727
C  4.584979 2.709937 0.253149
C  -4.141065 -0.012582 0.11916
C  5.261296 2.050241 1.280222
C  5.089135 3.930771 -0.195043
C  -4.319171 1.411847 2.093184
C  6.394346 2.597424 1.858826
C  6.22156 4.487978 0.374391
C  -3.779988 -1.297637 0.507849
C  -5.016821 0.177799 -0.937638
C  6.868271 3.815625 1.399553
C  -4.298165 -2.389712 -0.163348
C  -5.552263 -0.913642 -1.605609
C  -5.189439 -2.181469 -1.211175
C  -3.342886 -4.495727 -0.621764
C  -2.60134 -4.051238 -1.708012
C  -3.450879 -5.851715 -0.342371
C  -1.97831 -4.984899 -2.526598
C  -2.81818 -6.769336 -1.16618
C  -2.084023 -6.342978 -2.265834
H  0.992664 1.018969 -1.152967
H  0.161041 1.016818 1.833854
H  2.412685 -1.746986 1.046547
H  0.921136 -1.973857 1.957095
H  1.912818 -0.552292 2.242241
H  -0.331863 -0.974018 -1.445589
H  -0.553124 -2.137493 -0.135084
H  0.950595 -2.105618 -1.049401
H  2.624668 1.409214 1.462025
H  -3.70316 2.08564 0.231579
H  4.915706 1.084349 1.625309
H  4.593394 4.469911 -0.991435
H  -3.097688 -1.469045 1.331959
H  6.90755 2.065983 2.648874
H  6.591983 5.439646 0.017895
H  -5.289259 1.178314 -1.247954
H  -6.242447 -0.779894 -2.428286
H  -2.497741 -2.995493 -1.92668
H  -4.029071 -6.182022 0.51176
H  -1.405274 -4.638022 -3.376987
H  -2.908301 -7.825913 -0.948922
H  -1.599292 -7.062842 -2.912026
elementType: Cl F O N C H
totalener: -2381.01551438 hartree
nucrepener: 3695.17716946 hartree
electener: -6076.19268385 hartree
twoeener: 4533.09046773 hartree
cpcmener: -0.03832980 hartree
kineticenergy: 2373.48497064 hartree
xcener: -182.580697396623 hartree
chargesum: -0.0000000
charge: -0.111772 -0.092739 -0.206543 -0.280467 -0.428416 -0.323818 -0.086156 0.110081 0.014990 -0.076669 -0.271350 -0.282194 -0.170842 0.360649 0.045617 0.406155 0.086950 -0.002721 -0.211959 -0.168814 -0.229637 -0.142259 -0.159776 -0.211639 -0.156752 0.099409 0.152530 -0.160619 0.271468 0.308358 -0.206977 -0.243598 -0.164596 -0.123611 -0.183259 0.079458 0.101463 0.102238 0.101554 0.088906 0.098870 0.094351 0.105914 0.135290 0.145923 0.148658 0.136969 0.143521 0.141910 0.141941 0.147345 0.153098 0.153855 0.146075 0.158627 0.157000 0.158011
qa: -0.1118 -0.0927 -0.2065 -0.2805 -0.4284 -0.3238 -0.0862 0.1101 0.0150 -0.0767 -0.2713 -0.2822 -0.1708 0.3606 0.0456 0.4062 0.0869 -0.0027 -0.2120 -0.1688 -0.2296 -0.1423 -0.1598 -0.2116 -0.1568 0.0994 0.1525 -0.1606 0.2715 0.3084 -0.2070 -0.2436 -0.1646 -0.1236 -0.1833 0.0795 0.1015 0.1022 0.1016 0.0889 0.0989 0.0944 0.1059 0.1353 0.1459 0.1487 0.1370 0.1435 0.1419 0.1419 0.1473 0.1531 0.1539 0.1461 0.1586 0.1570 0.1580
va: 1.2204 1.2125 1.0853 2.1205 2.0824 2.0755 3.1121 3.7457 3.8725 3.8342 3.9068 3.9012 3.8467 4.2326 3.8679 3.7158 3.5959 3.6281 4.0027 3.9831 4.0768 3.9851 4.0195 3.9717 3.9560 3.8481 3.7815 3.9120 3.9725 3.6392 3.8678 3.9985 3.9279 3.8982 3.9055 1.0542 1.0306 1.0006 1.0022 1.0070 1.0138 0.9993 1.0027 1.0041 1.0141 1.0021 1.0211 1.0216 1.0066 1.0070 1.0000 0.9976 1.0003 1.0083 0.9912 0.9892 0.9899
dispcorr: -0.031028062 hartree
energy: -2381.046542444619
dipole: -8.70378 9.42919 0.72541 -25.29766 24.56721 -0.73045 -0.74890 0.21294 -0.53596
magnitude: 1.16061 au
magnitude: 2.95004 debye
