program: Gaussian 09
title: 000067496
version: EM64L-G09RevD.01
frameworkgroup: C1[X(C11H8N2S)]
method: RPBEPBE
basis: SDD
operation: Freq
keyword: #p
keyword: freq=noraman
keyword: PBEPBE/SDD
title: #p freq=noraman PBEPBE/SDD
converged: NO NO NO NO
title: Mulliken charges:
elementType: S N N C C C C C C C C C C C H H H H H H H H
charge: 0.216337 -0.447307 -0.078453 0.583647 -0.321154 0.147425 -0.231019 -0.402196 -0.274018 -0.182586 -0.212522 -0.253453 -0.180227 -0.342074 0.324701 0.229910 0.239110 0.246211 0.230900 0.232948 0.232036 0.241786
chargesum: 0.00000
title: Mulliken charges with hydrogens summed into heavy atoms:
elementType: S N N C C C C C C C C C C C
charge: 0.216337 -0.122607 -0.078453 0.583647 -0.321154 0.147425 -0.231019 -0.172285 -0.034909 0.063625 0.018377 -0.020505 0.051809 -0.100288
polarizability: 2.64028578e+02 -5.06241701e-01 1.46958919e+02 2.96751371e-03 -2.88095388e-03 5.44658968e+01
1716.lowfreq: -32.0161 -3.2184 0.0014 0.0015 0.0021 5.6485 9.0298 106.7007 160.5428
frequency: -31.1430 106.6981 160.5329 221.6780 250.0478 261.9374 335.5727 372.1849 424.4157 437.5789 440.4913 443.0487 532.9549 535.2468 596.3210 627.4053 633.9557 660.5430 680.7388 716.5861 746.7432 753.9439 785.2524 832.7562 849.9412 896.5121 914.0825 927.4032 952.8248 968.2846 1005.2516 1031.7940 1054.0512 1063.8725 1118.5801 1132.5003 1172.6990 1213.0561 1254.4601 1276.8987 1284.6896 1340.7404 1378.7165 1397.9785 1427.0849 1442.9063 1483.4989 1500.9831 1550.4460 1565.5561 1590.5752 1609.0219 3121.4398 3132.1390 3138.0795 3144.1072 3147.9208 3169.8183 3175.1122 3537.6200
redmass: 6.6130 4.2990 5.8454 5.2730 5.1601 4.4307 8.1026 5.5101 14.3334 3.8629 3.2070 11.2534 3.0670 3.5308 7.5173 1.2723 7.4102 6.6722 6.7807 3.1454 2.5051 1.9149 1.2963 6.0442 1.4311 5.1240 1.3581 1.3832 1.3666 1.3179 7.0446 4.1471 2.4965 2.3363 1.7079 1.4408 1.0595 1.4725 2.6173 1.4896 1.9845 5.1658 6.5494 1.7923 2.1863 3.1607 2.5732 3.0949 5.0229 5.2608 5.8347 7.2593 1.0881 1.0885 1.0875 1.0925 1.0928 1.1006 1.0997 1.0757
irintensity: 0.7251 0.6269 0.6047 1.2972 0.5436 6.9308 0.1209 6.3714 0.2662 4.9843 6.5961 0.2680 13.5751 2.2868 2.6887 53.0054 6.3876 5.4404 3.8346 12.2285 8.1913 138.3093 46.5487 0.1861 4.3514 1.3379 0.0118 3.8155 1.0313 0.1800 45.1716 11.9686 2.3195 9.1046 39.7209 5.6846 0.4425 3.0343 7.2032 1.7567 2.3754 15.8149 19.6894 1.6567 14.5175 351.5229 87.0890 422.0475 24.7692 43.7735 5.2316 22.0483 9.1285 1.1819 3.2983 17.2206 16.6428 25.5800 23.5380 39.8949
temp: 298.150 k
press: 1.00000 atm
elementType: 16 7 7 6 6 6 6 6 6 6 6 6 6 6 1 1 1 1 1 1 1 1
symmnumber: 1
zpe: 427828.1 jmol-1
zpe.correction: 0.162951 hartree
zpe.thermalcorrener: 0.172591 hartree
zpe.thermalcorrenthalpy: 0.173535 hartree
zpe.thermalcorrgfe: 0.127868 hartree
zpe.sumelectzpe: -930.585593 hartree
zpe.sumelectthermal: -930.575953 hartree
zpe.sumelectthermalent: -930.575008 hartree
zpe.sumelectthermalfe: -930.620676 hartree
dipole: 0.4159 -0.0273 0.0003
dipole: 0.4168
quadrupole: -72.7375 -82.1072 -94.8300
quadrupole: -5.2642 -0.0002 0.0001
quadrupole: 10.4874 1.1177 -11.6051 -5.2642 -0.0002 0.0001
hfenergy: -930.7485439 hartree
pointgroup: C01 [X(C11H8N2S1)]
dipole: 0.163564 0.0114379 -0.0001052 debye
dipolederiv: -0.6113466 0.0265686 0.0000037 0.1137481 -0.1254098 -0.0000083 -0.0000045 0.0000499 -0.0050561 -1.9764709 -0.0577772 0.0000363 -0.1742178 -0.2352109 0.0000164 0.0000515 0.0000078 -0.3512205 -0.7329631 -0.2803521 0.0000377 0.3255478 -0.3658908 -0.0000189 0.0001159 -0.000011 -0.2485115 1.2139453 -0.3565346 -0.0000503 -0.8146132 -0.0036639 0.0000455 -0.0000715 0.0000528 0.1232939 0.4133357 0.3016977 -0.0000793 0.8019 0.0357794 -0.0000444 -0.0000237 -0.0000432 -0.0791919 1.520717 0.4205841 -0.0000694 1.0844985 0.1831202 0.0000112 -0.0001229 -0.0000049 0.1745429 0.3515444 -0.3281616 0.0000968 -1.1150326 -0.0517559 -0.0000218 0.0000345 -0.0000349 -0.0460228 -0.3057378 0.1630564 -0.000015 -0.1590474 0.0785419 -0.0000138 0.0000393 -0.0000331 -0.2019168 -0.0593915 -0.0255167 -0.0000094 -0.1489854 0.0853001 -0.0000106 0.0000085 -0.0000259 -0.1104844 0.1586848 0.0521156 0.0000116 0.0479917 0.1529779 0.0000205 0.0000131 0.0000208 -0.0988801 0.0474147 -0.0617805 -0.0000121 0.0950859 0.1177769 -0.0000327 -0.0000614 -0.0000272 -0.1474397 -0.12047 -0.0521277 -0.0000026 -0.067116 -0.1064664 0.0000016 -0.0000087 0.0000007 -0.1953869 -0.2391752 0.0046954 0.0000316 0.2818894 -0.230015 0.0000205 0.0000442 -0.0000307 -0.1644776 0.2557804 0.1425548 -0.0000049 -0.2798812 0.3394745 0.0000226 -0.0000501 0.0000601 -0.0972551 0.1347505 -0.0068089 0.0000105 -0.0188013 0.1918548 -0.0000056 0.0000181 -0.0000155 0.3150363 0.0644216 0.0655123 0.0000066 0.0197269 -0.100752 0.0000206 0.000013 0.0000154 0.1690242 0.1136728 -0.0238086 0.0000069 0.0261115 -0.0718289 0.0000139 -0.0000017 0.0000211 0.1552478 0.1227998 0.0208567 -0.0000086 -0.0285332 -0.0585262 -0.000021 -0.0000216 -0.0000087 0.1506868 -0.0625459 -0.0984396 0.0000269 -0.117312 0.0168856 0.000023 0.000035 0.0000237 0.162592 -0.106463 0.0672187 0.0000136 0.0747107 0.0534778 0.0000047 0.0000167 0.0000037 0.1727799 -0.1044203 -0.0575885 -0.0000299 -0.0697754 0.0707535 -0.0000137 -0.0000224 -0.0000173 0.1793451 -0.0780826 0.0840359 -0.0000008 0.1221052 0.0235772 -0.0000098 -0.0000011 -0.0000039 0.1432943 unknown
polarizability: 264.0219109|1.0181854|146.9655858|-0.0029549|-0.0028939|54.4658968 unknown
InChI: InChI=1S/C11H8N2S/c1-2-5-9-8(4-1)13-11-10(14-9)6-3-7-12-11/h1-7,13H
charge 0 multiplicity 1
22 atoms
S  0.005953 -1.971291 0.000353
N  -0.030714 1.227409 0.000174
N  -2.34585 1.442016 0.000218
C  1.24389 0.623044 0.000063
C  1.415904 -0.790233 0.000134
C  -1.277489 0.595876 0.000212
C  -1.421692 -0.823199 0.00015
C  2.395907 1.450989 -0.000113
C  2.711893 -1.343263 0.000061
C  -2.723976 -1.355403 0.000002
C  3.691935 0.892202 -0.000178
C  3.855661 -0.510126 -0.000074
C  -3.842405 -0.481228 -0.000056
C  -3.602657 0.907476 0.000104
H  -0.086032 2.248566 0.000287
H  2.267202 2.540381 -0.000199
H  2.832355 -2.432727 0.000134
H  -2.870878 -2.441051 -0.000096
H  4.566013 1.551933 -0.000321
H  4.855059 -0.95652 -0.000109
H  -4.863025 -0.874061 -0.000195
H  -4.426455 1.629211 0.000149
