program: Orca
programVersion: 5.0.2
elementType: Cl Cl F O O O N C C C C C C C C C C C C C C C C C C C C C C C C C C C C H H H H H H H H H H H H H H H H H H H H H H
charge: 0
multiplicity: 1
keywords: wb97x-d3
keywords: def2-TZVPP
keywords: def2/J RIJCOSX
keywords: DEFGRID2
keywords: scfconv7
keywords: smallprint printgap noloewdin
keywords: NOSOSCF
formula: C28H22Cl2FNO3
InChI: InChI=1/C28H22Cl2FNO3/c1-28(2)21(15-22(30)17-8-11-19(29)12-9-17)26(28)27(33)35-25(16-32)18-10-13-23(31)24(14-18)34-20-6-4-3-5-7-20/h3-15,21,25-26H,1-2H3
57 atoms
Cl 2.217159 4.558719 1.403552
Cl 9.004854 3.118507 1.641867
F  -6.52074 -1.596845 -2.249373
O  -1.199443 -0.605244 0.89276
O  -1.770786 1.552958 0.73863
O  -4.522618 -3.33816 -2.213116
N  -2.090788 -3.057411 2.922413
C  0.486384 1.564674 -1.449496
C  1.012019 2.144165 -0.168618
C  0.319612 0.793755 -0.155921
C  1.44145 0.963958 -2.454354
C  -0.691885 2.248445 -2.097904
C  2.44571 2.215017 0.129596
C  -0.985746 0.671168 0.522394
C  3.088073 3.198206 0.761991
C  -2.446832 -0.88328 1.517409
C  4.542417 3.218416 0.979807
C  -3.550528 -1.072481 0.507581
C  5.401308 2.717714 0.001901
C  5.101107 3.712863 2.157032
C  -2.231274 -2.100722 2.30287
C  6.770168 2.677919 0.20058
C  6.468202 3.680108 2.366706
C  -3.50222 -2.151253 -0.369204
C  -4.589453 -0.159577 0.432655
C  7.298581 3.157578 1.387764
C  -4.507254 -2.337537 -1.303884
C  -5.596412 -0.333898 -0.505293
C  -5.55185 -1.416327 -1.355483
C  -4.014868 -4.569168 -1.891075
C  -4.276917 -5.182565 -0.672905
C  -3.264353 -5.214165 -2.861936
C  -3.768112 -6.449069 -0.430893
C  -2.773241 -6.486079 -2.610434
C  -3.01623 -7.105954 -1.394093
H  0.413093 2.952539 0.234698
H  0.955979 -0.078082 -0.054623
H  2.248998 0.394462 -1.995652
H  1.892093 1.745116 -3.068764
H  0.9076 0.284191 -3.119832
H  -1.341094 2.747704 -1.383728
H  -1.295609 1.532888 -2.658994
H  -0.331519 3.000344 -2.801852
H  3.060185 1.377363 -0.1803
H  -2.717371 -0.080755 2.210776
H  4.999384 2.375436 -0.942773
H  4.463122 4.121849 2.928586
H  -2.685158 -2.861442 -0.317007
H  7.422382 2.291796 -0.570308
H  6.886075 4.059086 3.288892
H  -4.616165 0.69403 1.095834
H  -6.419325 0.364242 -0.576121
H  -4.870759 -4.683897 0.082263
H  -3.076473 -4.722321 -3.807133
H  -3.967055 -6.924293 0.520279
H  -2.190536 -6.990105 -3.36997
H  -2.624683 -8.094618 -1.197449
totalener: -2380.98554095 hartree
nucrepener: 3621.66694796 hartree
electener: -6002.65248891 hartree
twoeener: 4459.79807180 hartree
kineticenergy: 2373.55499008 hartree
xcener: -182.590511646195 hartree
chargesum: 0.0000000
charge: -0.086563 -0.071652 -0.182350 -0.264243 -0.378587 -0.288463 -0.001928 0.069159 0.029815 -0.092364 -0.256941 -0.249102 -0.157342 0.354706 0.043848 0.332351 0.094446 -0.010040 -0.202364 -0.143719 -0.267023 -0.124824 -0.139086 -0.179180 -0.105213 0.089246 0.158270 -0.151426 0.190715 0.248008 -0.166335 -0.212107 -0.104885 -0.089939 -0.144020 0.090983 0.084137 0.071985 0.099070 0.097647 0.102376 0.089476 0.089499 0.096820 0.121028 0.125822 0.121866 0.134095 0.120870 0.121520 0.118035 0.127001 0.135144 0.126744 0.130786 0.126504 0.127727
qa: -0.0866 -0.0717 -0.1823 -0.2642 -0.3786 -0.2885 -0.0019 0.0692 0.0298 -0.0924 -0.2569 -0.2491 -0.1573 0.3547 0.0438 0.3324 0.0944 -0.0100 -0.2024 -0.1437 -0.2670 -0.1248 -0.1391 -0.1792 -0.1052 0.0892 0.1583 -0.1514 0.1907 0.2480 -0.1663 -0.2121 -0.1049 -0.0899 -0.1440 0.0910 0.0841 0.0720 0.0991 0.0976 0.1024 0.0895 0.0895 0.0968 0.1210 0.1258 0.1219 0.1341 0.1209 0.1215 0.1180 0.1270 0.1351 0.1267 0.1308 0.1265 0.1277
va: 1.2483 1.2354 1.1209 2.1342 2.1288 2.1224 3.1169 3.7613 3.8285 3.8728 3.9151 3.9144 3.8704 4.2337 3.9405 3.8381 3.6624 3.6825 4.0228 4.0097 4.0237 4.0130 4.0340 3.9585 3.9327 3.9501 3.7834 3.9224 4.0938 3.7960 3.9496 4.0421 3.9541 3.9335 3.9655 1.0502 1.0335 1.0108 1.0017 1.0050 1.0203 1.0017 1.0013 1.0179 1.0179 1.0084 1.0264 1.0157 1.0139 1.0136 1.0179 1.0071 1.0020 1.0129 0.9995 0.9988 1.0000
dispcorr: -0.028659462 hartree
energy: -2381.014200414887
dipole: -11.75354 11.95161 0.19807 -15.10767 15.23707 0.12939 -16.82818 15.83692 -0.99126
magnitude: 1.01910 au
magnitude: 2.59035 debye
