program: Orca
programVersion: 5.0.2
elementType: Cl Cl F O O O N C C C C C C C C C C C C C C C C C C C C C C C C C C C C H H H H H H H H H H H H H H H H H H H H H H
charge: 0
multiplicity: 1
keywords: wb97x-d3
keywords: def2-TZVPP
keywords: def2/J RIJCOSX
keywords: DEFGRID2
keywords: scfconv7
keywords: smallprint printgap noloewdin
keywords: NOSOSCF
formula: C28H22Cl2FNO3
InChI: InChI=1/C28H22Cl2FNO3/c1-28(2)21(15-22(30)17-8-11-19(29)12-9-17)26(28)27(33)35-25(16-32)18-10-13-23(31)24(14-18)34-20-6-4-3-5-7-20/h3-15,21,25-26H,1-2H3
57 atoms
Cl 0.69493 0.269469 2.139588
Cl 7.399979 -0.536025 0.563701
F  -2.386213 -3.897168 1.793708
O  -3.017991 1.790069 -0.334271
O  -2.607235 1.592533 -2.528403
O  -1.735427 -3.31393 -0.72582
N  -6.124634 2.111117 0.794935
C  -0.721253 3.83332 -0.289664
C  -0.271068 2.476706 0.166434
C  -0.980298 2.635257 -1.173254
C  0.288219 4.821906 -0.826402
C  -1.836362 4.503595 0.476693
C  1.126438 2.036506 0.171437
C  -2.273335 1.973477 -1.441093
C  1.667026 1.110488 0.965412
C  -4.147073 0.923076 -0.427128
C  3.076852 0.697316 0.907021
C  -3.778826 -0.407281 0.180894
C  3.444497 -0.644369 0.999446
C  4.07794 1.649405 0.723755
C  -5.250092 1.590972 0.262762
C  4.768757 -1.027231 0.886884
C  5.406906 1.277835 0.612103
C  -2.98324 -1.259212 -0.578656
C  -4.121221 -0.75427 1.47877
C  5.745882 -0.062919 0.69282
C  -2.498153 -2.436267 -0.034446
C  -3.664796 -1.946503 2.020155
C  -2.849249 -2.766107 1.270703
C  -0.67703 -2.86381 -1.468138
C  -0.367054 -3.590993 -2.607718
C  0.09343 -1.770753 -1.092957
C  0.725363 -3.221615 -3.375911
C  1.177945 -1.40798 -1.878282
C  1.499676 -2.127344 -3.019362
H  -0.884177 2.045073 0.947964
H  -0.347345 2.582268 -2.051804
H  1.057988 4.359296 -1.443303
H  0.785213 5.344816 -0.007993
H  -0.210286 5.569226 -1.444935
H  -2.432003 5.138705 -0.180713
H  -1.410187 5.14095 1.252871
H  -2.507676 3.802156 0.963697
H  1.792321 2.467703 -0.567915
H  -4.438085 0.795667 -1.474057
H  2.689717 -1.405126 1.146897
H  3.820482 2.700101 0.692976
H  -2.725437 -1.004671 -1.600042
H  5.039444 -2.071901 0.948944
H  6.17441 2.02746 0.47914
H  -4.745745 -0.106086 2.079241
H  -3.92497 -2.233429 3.029927
H  -0.976804 -4.441924 -2.880741
H  -0.134709 -1.209331 -0.196021
H  0.966485 -3.791752 -4.263203
H  1.778352 -0.557305 -1.583662
H  2.348746 -1.839215 -3.62375
totalener: -2380.98208264 hartree
nucrepener: 3989.66140020 hartree
electener: -6370.64348284 hartree
twoeener: 4827.22044705 hartree
kineticenergy: 2373.56393670 hartree
xcener: -182.594635756100 hartree
chargesum: -0.0000000
charge: -0.088733 -0.069092 -0.181715 -0.266607 -0.347668 -0.291939 0.000578 0.054019 0.071875 -0.067014 -0.263246 -0.240164 -0.172496 0.335180 0.027471 0.293210 0.115074 -0.015658 -0.198131 -0.212049 -0.270142 -0.119678 -0.118971 -0.157003 -0.146997 0.082445 0.158804 -0.145266 0.192904 0.263517 -0.216942 -0.161479 -0.079224 -0.097961 -0.166029 0.087162 0.085639 0.074598 0.098010 0.100397 0.094695 0.088524 0.094407 0.104010 0.136125 0.128711 0.130603 0.154860 0.124826 0.121778 0.126202 0.128812 0.127246 0.114448 0.125698 0.128089 0.124285
qa: -0.0887 -0.0691 -0.1817 -0.2666 -0.3477 -0.2919 0.0006 0.0540 0.0719 -0.0670 -0.2632 -0.2402 -0.1725 0.3352 0.0275 0.2932 0.1151 -0.0157 -0.1981 -0.2120 -0.2701 -0.1197 -0.1190 -0.1570 -0.1470 0.0824 0.1588 -0.1453 0.1929 0.2635 -0.2169 -0.1615 -0.0792 -0.0980 -0.1660 0.0872 0.0856 0.0746 0.0980 0.1004 0.0947 0.0885 0.0944 0.1040 0.1361 0.1287 0.1306 0.1549 0.1248 0.1218 0.1262 0.1288 0.1272 0.1144 0.1257 0.1281 0.1243
va: 1.2454 1.2378 1.1224 2.0829 2.1556 2.1298 3.1114 3.8142 3.7402 3.8150 3.9196 3.9118 3.8138 4.2602 3.9122 3.8397 3.5261 3.7786 3.9985 4.0382 4.0267 4.0420 4.0082 3.8851 3.9640 3.9549 3.7896 3.9300 4.1159 3.8293 4.0361 3.8669 3.9350 3.8985 4.0246 1.0466 1.0300 1.0102 1.0017 1.0037 1.0030 1.0018 1.0159 1.0173 1.0240 1.0213 1.0092 1.0115 1.0123 1.0137 1.0198 1.0068 1.0134 1.0276 0.9980 0.9991 1.0019
dispcorr: -0.035596268 hartree
energy: -2381.017678907450
dipole: -7.18560 8.36860 1.18300 25.53031 -24.82608 0.70423 -14.40871 14.07750 -0.33121
magnitude: 1.41602 au
magnitude: 3.59925 debye
