program: Gaussian 09
title: 000067493
version: EM64L-G09RevD.01
frameworkgroup: C1[X(C13H10N2)]
method: RPBEPBE
basis: SDD
operation: Freq
keyword: #pfreq=noraman
keyword: PBEPBE/SDD
title: #p freq=noraman PBEPBE/SDD
converged: NO YES NO NO
title: Mulliken charges:
elementType: N N C C C C C C C C C C C C C H H H H H H H H H H
charge: -0.097058 -0.095885 -0.609922 0.302808 0.300590 0.097175 0.094483 -0.343952 -0.339255 -0.367489 -0.366966 -0.257242 -0.257202 -0.212252 -0.211865 0.241000 0.238268 0.234339 0.234627 0.247129 0.247067 0.229207 0.229234 0.231509 0.231650
chargesum: 0.00000
title: Mulliken charges with hydrogens summed into heavy atoms:
elementType: N N C C C C C C C C C C C C C
charge: -0.097058 -0.095885 -0.130653 0.302808 0.300590 0.097175 0.094483 -0.109613 -0.104628 -0.120360 -0.119898 -0.028035 -0.027968 0.019257 0.019785
polarizability: 2.70905139e+02 -2.52203700e-01 1.47413964e+02 2.36311523e-01 -2.97781410e-02 7.02979595e+01
1716.lowfreq: -7.0527 0.0003 0.0004 0.0005 4.9368 12.9723 37.5742 101.9663 144.5824
frequency: 37.1886 101.9641 144.5800 157.3960 219.3774 247.8451 297.1764 331.2374 404.4486 416.3841 431.5899 467.2455 514.4946 521.1577 552.4229 588.9746 629.0923 637.6566 693.8230 717.3833 732.7577 764.1664 769.1639 776.8528 823.3982 842.7602 850.6740 875.3793 906.4463 945.3445 952.9912 981.4385 981.7876 1024.5335 1027.4611 1085.9834 1087.7037 1141.2731 1160.4728 1168.5909 1179.7212 1183.2833 1222.9329 1237.0207 1239.2255 1263.3230 1282.4895 1304.7131 1368.4626 1379.8723 1418.5865 1434.2067 1436.5815 1448.4328 1455.8126 1558.7820 1567.8742 1595.0657 1598.9477 2957.2974 2999.5395 3114.6810 3115.3729 3137.2826 3137.3199 3153.9775 3154.1249 3169.3564 3169.7207
redmass: 3.3207 3.9802 2.5465 4.9166 5.1592 5.1760 5.0133 5.9672 3.5239 2.9092 4.8377 4.9514 7.4332 5.0903 4.0485 6.5009 5.8540 4.8653 2.3843 3.9512 2.0079 1.5069 4.6661 2.4628 2.6079 2.4298 1.9918 1.8451 2.0272 1.3983 1.5305 1.3271 1.3301 2.4712 2.1362 2.5196 3.5796 1.9550 1.6540 1.1049 1.4622 2.1585 1.5109 1.2426 2.7116 2.3751 2.4183 1.7029 7.0724 3.3484 1.2778 2.1104 2.3887 2.5466 2.1066 5.7265 6.1415 6.4215 6.4140 1.0598 1.0975 1.0883 1.0883 1.0878 1.0878 1.0937 1.0938 1.1001 1.1001
irintensity: 0.0468 0.0523 8.8513 1.4400 8.5778 0.2774 10.9918 1.2028 2.2161 24.1976 2.2447 0.8208 2.1381 4.4681 17.0377 2.4066 0.0394 2.3173 23.2629 4.8776 2.9072 139.9952 2.8256 8.1732 4.2246 0.2389 10.2780 0.7972 1.4280 0.4267 9.3324 0.0953 0.3962 0.1060 10.3524 2.9204 20.5158 0.4617 1.8564 0.0879 0.4366 8.8365 0.1657 0.9788 6.1354 19.8120 25.0028 0.3774 0.0876 11.4898 3.6686 15.0435 0.6286 20.4085 1.9569 4.7354 0.0764 7.4248 0.0207 7.3670 6.8874 3.3363 9.7359 4.5227 9.2349 17.2647 21.5091 55.4460 0.8448
temp: 298.150 k
press: 1.00000 atm
elementType: 7 7 6 6 6 6 6 6 6 6 6 6 6 6 6 1 1 1 1 1 1 1 1 1 1
symmnumber: 1
zpe: 504193.8 jmol-1
zpe.correction: 0.192037 hartree
zpe.thermalcorrener: 0.203188 hartree
zpe.thermalcorrenthalpy: 0.204133 hartree
zpe.thermalcorrgfe: 0.154680 hartree
zpe.sumelectzpe: -609.767817 hartree
zpe.sumelectthermal: -609.756666 hartree
zpe.sumelectthermalent: -609.755721 hartree
zpe.sumelectthermalfe: -609.805174 hartree
dipole: -0.0087 2.2221 0.0067
dipole: 2.2221
quadrupole: -68.6684 -77.6279 -94.2625
quadrupole: -0.0366 0.2459 0.0392
quadrupole: 11.5179 2.5584 -14.0763 -0.0366 0.2459 0.0392
hfenergy: -609.9598539 hartree
pointgroup: C01 [X(C13H10N2)]
dipole: 0.0034766 -0.8742361 0.0048414 debye
dipolederiv: -0.0341786 0.3017779 -0.0499397 -0.402096 -0.2066892 -0.1133556 -0.2789559 -0.5818638 -0.1285289 -0.0126544 -0.3035724 -0.0490341 0.4024014 -0.2078856 0.1116265 -0.2911152 0.5811812 -0.1209637 0.0413643 -0.0013999 -0.0087172 0.0023225 -0.0312592 0.0068057 -0.0461241 0.0182755 0.1618837 -0.1108051 -0.1403385 0.0663007 -0.2319468 0.0209563 -0.0328176 0.2381915 0.0165278 -0.0505993 -0.0962068 0.1418293 0.0529889 0.2280453 0.023883 0.0289736 0.2215292 -0.0291026 -0.0571912 0.2738762 -0.0876788 0.0141681 0.0701093 0.0402774 0.0843217 0.2532033 0.0454207 0.0514735 0.2616342 0.0897481 0.0176316 -0.0723365 0.0391638 -0.0802474 0.253306 -0.0441956 0.052711 0.0144175 0.0462386 -0.0067398 0.0477787 0.135884 0.0661376 -0.113253 0.0507389 -0.1335072 0.0054573 -0.0473804 -0.0045964 -0.0508068 0.1358774 -0.0678717 -0.110936 -0.052942 -0.1319526 -0.0221222 -0.0271108 -0.0367768 -0.0130249 0.0721837 0.0529409 -0.0651971 0.0248328 -0.121631 -0.0192201 0.0257213 -0.0388349 0.011777 0.0722412 -0.0540268 -0.0700398 -0.0260446 -0.1207285 -0.1317026 0.0416364 0.0248136 0.1612679 0.0235663 0.0460836 0.0533163 0.0587144 -0.1468642 -0.1314851 -0.0421057 0.0211521 -0.1612434 0.0258526 -0.0446676 0.0538346 -0.0567143 -0.1476902 0.0450167 -0.0411216 0.004298 -0.2249159 -0.0487013 0.0420037 -0.0448118 0.0225212 -0.1398432 0.0443331 0.0417901 0.0005309 0.2284453 -0.0503397 -0.0432882 -0.0486794 -0.0231107 -0.139459 -0.0251834 0.0209021 -0.0003177 0.0177771 0.0323942 0.0813693 0.0022727 0.0999595 -0.0044725 -0.0208926 -0.0224685 0.0000279 -0.0149694 0.0175553 -0.0856386 0.0013589 -0.1052538 0.0069209 0.0700725 0.0624063 0.0146951 -0.0008609 -0.0886022 -0.0548231 -0.0227499 -0.0430338 0.1351599 0.0712789 -0.0610415 0.0151401 0.001059 -0.0888398 0.0558534 -0.0230233 0.0435498 0.1347943 0.0827133 -0.0004862 0.000391 0.0442477 -0.0505784 -0.0563602 0.0244145 -0.0469623 0.1494254 0.0830033 0.0016814 0.0014332 -0.0435043 -0.0500233 0.0573404 0.0249053 0.0482536 0.1485505 -0.0668054 -0.0912134 -0.0339237 -0.1102157 0.0210518 -0.0417133 -0.0216503 -0.0443205 0.1489234 -0.0673815 0.0919148 -0.0309286 0.110507 0.0210179 0.0400215 -0.0186733 0.0425501 0.1498693 -0.127664 0.0709884 0.0111117 0.0698628 0.0705375 -0.0205473 0.011916 -0.0196128 0.1520619 -0.1268655 -0.0707172 0.0151262 -0.0696803 0.0704762 0.0218796 0.0169609 0.0206313 0.1516579 unknown
polarizability: 270.9053301|-0.2410188|147.4135777|0.1621779|-0.1651646|70.2981539 unknown
InChI: InChI=1S/C13H10N2/c1-3-7-12-10(5-1)9-11-6-2-4-8-13(11)15-14-12/h1-8H,9H2
charge 0 multiplicity 1
25 atoms
N  -0.397801 1.360641 0.537088
N  0.395724 1.364045 -0.526177
C  0.000447 -1.329645 0.027297
C  -1.384341 -0.642165 -0.105499
C  1.387956 -0.639964 0.116335
C  -1.641347 0.737925 0.207614
C  1.638978 0.739451 -0.204249
C  -2.514448 -1.462364 -0.353461
C  2.522897 -1.458979 0.346905
C  -2.947991 1.253997 0.344745
C  2.944122 1.25526 -0.363299
C  -3.826237 -0.946035 -0.276957
C  3.832888 -0.942769 0.248671
C  -4.044499 0.408093 0.085019
C  4.044845 0.411271 -0.118676
H  -0.077854 -1.973449 0.929018
H  0.075029 -2.038463 -0.823774
H  -2.363739 -2.520554 -0.602726
H  2.376624 -2.517065 0.599507
H  -3.089463 2.305741 0.612316
H  3.080282 2.306108 -0.637107
H  -4.680364 -1.598942 -0.48622
H  4.690481 -1.595447 0.443993
H  -5.065553 0.798455 0.154686
H  5.064463 0.801853 -0.205751
