program: Orca
programVersion: 5.0.2
elementType: F F O O O O N C C C C C C C C C C C C C C C C C C C C C C C C C C H H H H H H H H H H H H H H H H H H H H H H H
charge: 0
multiplicity: 1
keywords: wb97x-d3
keywords: def2-TZVPP
keywords: def2/J RIJCOSX
keywords: DEFGRID2
keywords: scfconv7
keywords: smallprint printgap noloewdin
keywords: NOSOSCF
formula: C26H23F2NO4
InChI: InChI=1/C26H23F2NO4/c1-17(2)24(18-11-13-21(14-12-18)32-26(27)28)25(30)33-23(16-29)19-7-6-10-22(15-19)31-20-8-4-3-5-9-20/h3-15,17,23-24,26H,1-2H3
56 atoms
F  -3.819268 -2.124793 -0.254955
F  -3.935227 -1.348036 -2.267961
O  3.099355 0.412761 0.722766
O  4.26232 -0.620334 -0.895615
O  -2.07532 -2.247752 -1.631203
O  -1.541297 3.164331 0.769845
N  3.869488 3.512788 1.59495
C  3.065772 -1.92875 0.752892
C  3.985485 -3.139676 0.564885
C  1.678437 -2.067032 0.151396
C  5.324437 -2.901588 1.255231
C  3.324182 -4.393583 1.122973
C  3.589279 -0.67295 0.099413
C  1.505105 -2.471161 -1.171299
C  0.555531 -1.707834 0.884029
C  3.016118 1.637469 -0.008723
C  0.245958 -2.517816 -1.740732
C  -0.718683 -1.761892 0.333461
C  -0.862965 -2.158077 -0.987689
C  1.584854 1.807901 -0.451473
C  0.646869 2.429661 0.360479
C  1.191865 1.202659 -1.640363
C  -0.6827 2.465486 -0.033744
C  3.483645 2.68848 0.892109
C  -0.144306 1.225435 -2.008775
C  -1.089177 1.859665 -1.215967
C  -3.115097 -1.474197 -1.212987
C  -2.829796 2.714482 0.939513
C  -3.099363 1.386528 1.243396
C  -3.850909 3.648686 0.857324
C  -4.413647 0.9938 1.452245
C  -5.159784 3.245004 1.08385
C  -5.447222 1.91845 1.374106
H  2.952884 -1.742417 1.825172
H  4.166993 -3.290722 -0.503223
H  5.850935 -2.030052 0.86447
H  5.981822 -3.761556 1.122035
H  5.187456 -2.753501 2.328781
H  2.403627 -4.647024 0.596704
H  3.995703 -5.248591 1.036085
H  3.080759 -4.271456 2.181027
H  2.358687 -2.746262 -1.777894
H  0.665024 -1.388654 1.912956
H  3.685738 1.630332 -0.873229
H  0.121484 -2.824975 -2.771049
H  -1.566255 -1.507062 0.955628
H  0.931856 2.8955 1.29669
H  1.92206 0.714821 -2.273221
H  -0.456017 0.755302 -2.931761
H  -2.12507 1.888417 -1.528947
H  -2.825712 -0.489203 -0.841537
H  -2.294949 0.666105 1.325181
H  -3.6233 4.680948 0.623576
H  -4.626289 -0.041392 1.684351
H  -5.957551 3.973611 1.023825
H  -6.46943 1.607072 1.542006
elementType: F O N C H
totalener: -1560.10578744 hartree
nucrepener: 3443.09672606 hartree
electener: -5003.20251351 hartree
oneelecener: -8975.77066630 hartree
twoeener: 3972.56815280 hartree
cpcmener: -0.04351571 hartree
kineticenergy: 1553.61895710 hartree
xcener: -146.815448640054 hartree
chargesum: 0.0000000
charge: -0.211301 -0.204401 -0.278099 -0.439795 -0.291790 -0.339375 -0.099338 0.129695 0.063022 0.004371 -0.297349 -0.309813 0.343552 -0.185572 -0.231941 0.412287 -0.206589 -0.184734 0.263528 0.012517 -0.226318 -0.216948 0.282477 -0.220957 -0.113237 -0.214797 0.464500 0.271601 -0.200903 -0.229073 -0.171131 -0.137584 -0.167512 0.100713 0.045054 0.095178 0.093902 0.090122 0.098626 0.097196 0.091242 0.145951 0.141100 0.139062 0.146119 0.157491 0.127097 0.153189 0.161372 0.163229 0.068366 0.187793 0.147947 0.157204 0.161554 0.161501
qa: -0.2113 -0.2044 -0.2781 -0.4398 -0.2918 -0.3394 -0.0993 0.1297 0.0630 0.0044 -0.2973 -0.3098 0.3436 -0.1856 -0.2319 0.4123 -0.2066 -0.1847 0.2635 0.0125 -0.2263 -0.2169 0.2825 -0.2210 -0.1132 -0.2148 0.4645 0.2716 -0.2009 -0.2291 -0.1711 -0.1376 -0.1675 0.1007 0.0451 0.0952 0.0939 0.0901 0.0986 0.0972 0.0912 0.1460 0.1411 0.1391 0.1461 0.1575 0.1271 0.1532 0.1614 0.1632 0.0684 0.1878 0.1479 0.1572 0.1616 0.1615
va: 1.0541 1.0752 2.1262 2.0529 2.0585 2.0713 3.1081 3.6458 3.8070 3.4783 3.9296 3.9462 4.2477 3.9449 4.0105 3.7181 4.0168 3.8254 3.7431 3.6844 4.1005 3.8869 3.7683 4.0816 3.8315 3.8588 4.2482 3.6997 3.8525 3.9958 3.8824 3.8892 3.8917 1.0350 1.0276 1.0120 1.0041 1.0022 1.0010 1.0043 1.0021 1.0100 1.0091 1.0248 1.0070 1.0016 1.0295 1.0067 0.9931 0.9910 0.9799 0.9718 1.0064 1.0020 0.9875 0.9887
dispcorr: -0.036389351 hartree
energy: -1560.142176792879
dipole: 19.72185 -20.64823 -0.92639 -13.61275 12.43359 -1.17915 8.74848 -9.06844 -0.31996
magnitude: 1.53329 au
magnitude: 3.89731 debye
