program: Orca
programVersion: 5.0.2
elementType: F F O O O O N C C C C C C C C C C C C C C C C C C C C C C C C C C H H H H H H H H H H H H H H H H H H H H H H H
charge: 0
multiplicity: 1
keywords: wb97x-d3
keywords: def2-TZVPP
keywords: def2/J RIJCOSX
keywords: DEFGRID2
keywords: scfconv7
keywords: smallprint printgap noloewdin
keywords: NOSOSCF
formula: C26H23F2NO4
InChI: InChI=1/C26H23F2NO4/c1-17(2)24(18-11-13-21(14-12-18)32-26(27)28)25(30)33-23(16-29)19-7-6-10-22(15-19)31-20-8-4-3-5-9-20/h3-15,17,23-24,26H,1-2H3
56 atoms
F  -5.061144 -2.415974 -0.484837
F  -3.577992 -3.801668 -1.22893
O  2.591298 0.21716 -0.838447
O  3.509192 0.541287 1.16612
O  -3.073553 -2.315665 0.34763
O  -1.388282 2.434105 1.338294
N  5.286271 2.23195 -1.19077
C  2.55419 -1.619359 0.648283
C  3.385265 -2.595454 -0.213547
C  1.054481 -1.773483 0.503296
C  4.878542 -2.326423 -0.061846
C  3.061933 -4.029249 0.186802
C  2.946913 -0.187055 0.39131
C  0.246936 -1.707864 1.635272
C  0.436594 -1.977943 -0.724934
C  2.750489 1.590931 -1.144492
C  -1.125949 -1.869708 1.552946
C  -0.936092 -2.156611 -0.828079
C  -1.715833 -2.110503 0.320063
C  1.899131 2.489957 -0.270109
C  0.634585 2.043417 0.095898
C  2.340648 3.74357 0.130901
C  -0.173885 2.860922 0.871208
C  4.172366 1.951647 -1.132623
C  1.513948 4.551197 0.897563
C  0.252845 4.118212 1.27077
C  -3.763519 -2.527485 -0.80637
C  -2.342031 1.920953 0.500794
C  -2.359656 2.132116 -0.87196
C  -3.361053 1.205163 1.119481
C  -3.408077 1.611349 -1.620539
C  -4.406715 0.706667 0.360217
C  -4.434889 0.901826 -1.015298
H  2.814374 -1.807473 1.69349
H  3.120654 -2.459338 -1.265735
H  5.172715 -1.345568 -0.440728
H  5.452127 -3.066228 -0.621107
H  5.187212 -2.390129 0.983789
H  3.652881 -4.731235 -0.402442
H  3.294631 -4.201438 1.239993
H  2.011505 -4.276606 0.032542
H  0.697318 -1.54182 2.606307
H  1.020113 -2.03078 -1.634567
H  2.418434 1.679619 -2.182333
H  -1.735836 -1.830561 2.446331
H  -1.354353 -2.346302 -1.807141
H  0.277094 1.065639 -0.20568
H  3.324995 4.101934 -0.141117
H  1.859595 5.526856 1.210981
H  -0.391779 4.742261 1.875932
H  -3.522639 -1.840147 -1.618866
H  -1.581604 2.699175 -1.365654
H  -3.336291 1.052259 2.191114
H  -3.420288 1.776335 -2.689975
H  -5.202421 0.161833 0.850351
H  -5.250569 0.509253 -1.607592
elementType: F O N C H
totalener: -1560.10507004 hartree
nucrepener: 3468.17565089 hartree
electener: -5028.28072093 hartree
oneelecener: -9027.22490802 hartree
twoeener: 3998.94418709 hartree
cpcmener: -0.04718279 hartree
kineticenergy: 1553.61986187 hartree
xcener: -146.821187455450 hartree
chargesum: -0.0000000
charge: -0.198936 -0.210718 -0.272870 -0.428934 -0.277234 -0.332673 -0.094040 0.186890 0.044701 -0.065900 -0.296542 -0.303629 0.306985 -0.144037 -0.214973 0.477764 -0.221115 -0.148462 0.269778 -0.030253 -0.250052 -0.207531 0.307179 -0.239754 -0.100129 -0.244555 0.375692 0.347959 -0.214010 -0.296408 -0.152296 -0.113320 -0.204141 0.093669 0.062837 0.089456 0.094354 0.095807 0.097035 0.092375 0.099921 0.141192 0.140552 0.145514 0.145615 0.137831 0.145462 0.134086 0.162931 0.148087 0.129759 0.156562 0.144973 0.161653 0.160838 0.165053
qa: -0.1989 -0.2107 -0.2729 -0.4289 -0.2772 -0.3327 -0.0940 0.1869 0.0447 -0.0659 -0.2965 -0.3036 0.3070 -0.1440 -0.2150 0.4778 -0.2211 -0.1485 0.2698 -0.0303 -0.2501 -0.2075 0.3072 -0.2398 -0.1001 -0.2446 0.3757 0.3480 -0.2140 -0.2964 -0.1523 -0.1133 -0.2041 0.0937 0.0628 0.0895 0.0944 0.0958 0.0970 0.0924 0.0999 0.1412 0.1406 0.1455 0.1456 0.1378 0.1455 0.1341 0.1629 0.1481 0.1298 0.1566 0.1450 0.1617 0.1608 0.1651
va: 1.0709 1.0601 2.1233 2.0681 2.0352 2.0681 3.0951 3.6204 3.8105 3.5734 3.9500 3.9331 4.2104 3.9436 3.9657 3.8106 3.9440 3.8971 3.7319 3.7686 3.9983 3.9465 3.6787 4.1068 3.8906 4.0324 4.2651 3.6151 3.8810 3.9433 3.8898 3.7891 3.8284 1.0324 1.0211 1.0075 1.0040 1.0039 1.0051 1.0012 1.0008 1.0020 1.0135 0.9906 1.0069 1.0118 1.0017 1.0164 0.9881 1.0051 0.9689 0.9977 1.0113 0.9897 0.9957 0.9889
dispcorr: -0.036132932 hartree
energy: -1560.141202973563
dipole: 21.66793 -22.87051 -1.20258 -4.11266 3.82307 -0.28959 0.65039 -2.22067 -1.57028
magnitude: 1.99897 au
magnitude: 5.08097 debye
