program: Orca
programVersion: 5.0.2
elementType: F F O O O O N C C C C C C C C C C C C C C C C C C C C C C C C C C H H H H H H H H H H H H H H H H H H H H H H H
charge: 0
multiplicity: 1
keywords: wb97x-d3
keywords: def2-TZVPP
keywords: def2/J RIJCOSX
keywords: DEFGRID2
keywords: scfconv7
keywords: smallprint printgap noloewdin
keywords: NOSOSCF
formula: C26H23F2NO4
InChI: InChI=1/C26H23F2NO4/c1-17(2)24(18-11-13-21(14-12-18)32-26(27)28)25(30)33-23(16-29)19-7-6-10-22(15-19)31-20-8-4-3-5-9-20/h3-15,17,23-24,26H,1-2H3
56 atoms
F  -3.194219 -3.381191 1.975071
F  -3.242251 -1.268082 2.438085
O  2.995952 0.567498 -0.127812
O  1.820156 0.416012 -2.025232
O  -1.450703 -2.471588 3.04861
O  -2.342127 2.546872 -0.10126
N  4.295504 3.028828 1.641589
C  2.543285 -1.603928 -0.901295
C  2.448047 -2.433987 -2.186826
C  1.450082 -1.8903 0.112612
C  3.60579 -2.113812 -3.125844
C  2.44605 -3.920036 -1.849049
C  2.425817 -0.117719 -1.133609
C  0.109608 -1.723763 -0.217629
C  1.763515 -2.263335 1.414108
C  2.525991 1.900504 0.08677
C  -0.901842 -1.917057 0.711922
C  0.76831 -2.46653 2.35541
C  -0.562848 -2.282727 2.00816
C  1.158875 1.850944 0.724287
C  0.057071 2.281121 0.000654
C  1.003678 1.282504 1.984948
C  -1.21287 2.12224 0.542892
C  3.519509 2.519313 0.962889
C  -0.266902 1.152888 2.519476
C  -1.380449 1.55959 1.798608
C  -2.797631 -2.466341 2.888322
C  -2.445784 2.4399 -1.466592
C  -1.983949 1.329637 -2.163881
C  -3.096233 3.473495 -2.124871
C  -2.172961 1.270737 -3.537586
C  -3.288543 3.394036 -3.496794
C  -2.823277 2.297438 -4.209751
H  3.508378 -1.806104 -0.426038
H  1.50794 -2.19571 -2.693617
H  4.563715 -2.341358 -2.65266
H  3.625534 -1.067254 -3.430766
H  3.53738 -2.712707 -4.034821
H  1.591414 -4.204875 -1.234972
H  2.406527 -4.516937 -2.761008
H  3.353618 -4.201746 -1.309814
H  -0.174035 -1.431148 -1.221252
H  2.798559 -2.396098 1.703169
H  2.507585 2.476682 -0.842888
H  -1.920264 -1.755797 0.392687
H  1.026244 -2.754071 3.366702
H  0.194389 2.729677 -0.975369
H  1.863927 0.941197 2.547475
H  -0.397462 0.712735 3.498756
H  -2.37456 1.449573 2.211397
H  -3.255908 -2.684425 3.850798
H  -1.487861 0.514369 -1.651376
H  -3.454373 4.329011 -1.565892
H  -1.811912 0.40822 -4.082586
H  -3.799702 4.199172 -4.008145
H  -2.968797 2.241347 -5.280172
elementType: F O N C H
totalener: -1560.10410966 hartree
nucrepener: 3485.62731897 hartree
electener: -5045.73142863 hartree
oneelecener: -9062.96321717 hartree
twoeener: 4017.23178855 hartree
cpcmener: -0.04107917 hartree
kineticenergy: 1553.61224911 hartree
xcener: -146.815404227124 hartree
chargesum: -0.0000000
charge: -0.214712 -0.213643 -0.278076 -0.441637 -0.314910 -0.338833 -0.099684 0.133318 0.061131 -0.024987 -0.293399 -0.314547 0.336340 -0.253754 -0.159304 0.412468 -0.173170 -0.193342 0.291097 0.069751 -0.215616 -0.297872 0.326691 -0.224989 -0.068216 -0.274823 0.432192 0.272818 -0.158233 -0.231353 -0.188242 -0.139465 -0.167434 0.100369 0.046627 0.090130 0.093722 0.093640 0.097773 0.098538 0.091257 0.155611 0.138471 0.138702 0.132613 0.143228 0.147666 0.148616 0.159597 0.143591 0.140859 0.152372 0.148673 0.160397 0.160630 0.161353
qa: -0.2147 -0.2136 -0.2781 -0.4416 -0.3149 -0.3388 -0.0997 0.1333 0.0611 -0.0250 -0.2934 -0.3145 0.3363 -0.2538 -0.1593 0.4125 -0.1732 -0.1933 0.2911 0.0698 -0.2156 -0.2979 0.3267 -0.2250 -0.0682 -0.2748 0.4322 0.2728 -0.1582 -0.2314 -0.1882 -0.1395 -0.1674 0.1004 0.0466 0.0901 0.0937 0.0936 0.0978 0.0985 0.0913 0.1556 0.1385 0.1387 0.1326 0.1432 0.1477 0.1486 0.1596 0.1436 0.1409 0.1524 0.1487 0.1604 0.1606 0.1614
va: 1.0686 1.0682 2.1477 2.0457 2.1105 2.0753 3.1102 3.6641 3.8144 3.4616 3.9237 3.9493 4.2555 3.9840 3.9611 3.7366 3.8896 3.9670 3.6586 3.5312 3.9488 3.9743 3.6666 4.0799 3.8189 3.9890 4.2262 3.6942 3.8615 3.9819 3.9307 3.8919 3.8816 1.0379 1.0255 1.0019 1.0136 1.0043 1.0003 1.0043 1.0018 1.0046 1.0029 1.0175 1.0347 1.0063 1.0100 1.0094 0.9904 1.0179 0.9730 0.9876 1.0071 0.9914 0.9885 0.9889
dispcorr: -0.036578492 hartree
energy: -1560.140688150291
dipole: 16.17581 -16.80456 -0.62875 -8.90028 7.29865 -1.60162 -23.35350 23.09146 -0.26204
magnitude: 1.74045 au
magnitude: 4.42388 debye
