program: Orca
programVersion: 5.0.2
elementType: F F O O O O N C C C C C C C C C C C C C C C C C C C C C C C C C C H H H H H H H H H H H H H H H H H H H H H H H
charge: 0
multiplicity: 1
keywords: wb97x-d3
keywords: def2-TZVPP
keywords: def2/J RIJCOSX
keywords: DEFGRID2
keywords: scfconv7
keywords: smallprint printgap noloewdin
keywords: NOSOSCF
formula: C26H23F2NO4
InChI: InChI=1/C26H23F2NO4/c1-17(2)24(18-11-13-21(14-12-18)32-26(27)28)25(30)33-23(16-29)19-7-6-10-22(15-19)31-20-8-4-3-5-9-20/h3-15,17,23-24,26H,1-2H3
56 atoms
F  -3.403698 -1.251304 1.981838
F  -3.614384 -2.909619 3.348989
O  3.092987 0.567459 -0.039238
O  2.002819 0.480476 -1.991313
O  -1.634169 -2.440101 2.642978
O  -2.262793 2.58302 -0.0017
N  4.302175 2.96057 1.875057
C  2.697761 -1.575852 -0.916996
C  2.737796 -2.347535 -2.240764
C  1.519531 -1.909481 -0.018775
C  3.967358 -1.957428 -3.054285
C  2.744954 -3.846434 -1.967084
C  2.57394 -0.082204 -1.094419
C  1.717674 -2.311444 1.298075
C  0.213488 -1.729945 -0.461025
C  2.59979 1.884756 0.211449
C  0.64681 -2.514405 2.151727
C  -0.872233 -1.914069 0.382827
C  -0.646316 -2.293894 1.699038
C  1.218372 1.793209 0.813536
C  0.126679 2.266035 0.100989
C  1.043693 1.156915 2.03907
C  -1.148792 2.090462 0.624829
C  3.56026 2.477765 1.141079
C  -0.232798 1.000356 2.550361
C  -1.335701 1.456309 1.842227
C  -2.942101 -2.493767 2.266401
C  -2.446349 2.399888 -1.348389
C  -3.17446 3.380225 -2.009219
C  -1.993718 1.274475 -2.025881
C  -3.454003 3.230662 -3.35922
C  -2.273491 1.144765 -3.379751
C  -3.001238 2.116344 -4.052959
H  3.617738 -1.786923 -0.363276
H  1.841541 -2.106334 -2.820292
H  4.884196 -2.178698 -2.503124
H  3.983278 -0.898495 -3.314372
H  4.002287 -2.5191 -3.988561
H  2.820388 -4.403867 -2.901496
H  3.598414 -4.127694 -1.345591
H  1.839069 -4.178726 -1.45967
H  2.723336 -2.459839 1.671139
H  0.018742 -1.418277 -1.479898
H  2.596418 2.497119 -0.694889
H  0.816236 -2.818259 3.176768
H  -1.863219 -1.725778 -0.007206
H  0.272022 2.766213 -0.848767
H  1.895779 0.784563 2.594228
H  -0.376071 0.505237 3.501231
H  -2.33453 1.332982 2.239036
H  -3.14349 -3.152551 1.419062
H  -3.524988 4.249246 -1.466935
H  -1.434771 0.499917 -1.515766
H  -4.024076 3.995962 -3.869311
H  -1.92084 0.268371 -3.907615
H  -3.216356 2.004513 -5.107097
elementType: F O N C H
totalener: -1560.10538239 hartree
nucrepener: 3480.94224653 hartree
electener: -5041.04762892 hartree
oneelecener: -9052.86084315 hartree
twoeener: 4011.81321423 hartree
cpcmener: -0.04350332 hartree
kineticenergy: 1553.61961700 hartree
xcener: -146.816621741889 hartree
chargesum: 0.0000000
charge: -0.206795 -0.201278 -0.277821 -0.442417 -0.292454 -0.340646 -0.099544 0.131561 0.062518 -0.038754 -0.295001 -0.314086 0.335541 -0.142821 -0.225589 0.415550 -0.219438 -0.177662 0.288162 0.069240 -0.206136 -0.288126 0.311163 -0.225025 -0.069730 -0.266975 0.390536 0.274887 -0.233036 -0.141234 -0.140583 -0.198356 -0.168470 0.098636 0.046777 0.090384 0.094593 0.094031 0.098139 0.090938 0.098241 0.139692 0.153930 0.138211 0.143824 0.140602 0.149282 0.148707 0.159903 0.142084 0.136667 0.148107 0.138177 0.160793 0.159918 0.161179
qa: -0.2068 -0.2013 -0.2778 -0.4424 -0.2925 -0.3406 -0.0995 0.1316 0.0625 -0.0388 -0.2950 -0.3141 0.3355 -0.1428 -0.2256 0.4156 -0.2194 -0.1777 0.2882 0.0692 -0.2061 -0.2881 0.3112 -0.2250 -0.0697 -0.2670 0.3905 0.2749 -0.2330 -0.1412 -0.1406 -0.1984 -0.1685 0.0986 0.0468 0.0904 0.0946 0.0940 0.0981 0.0909 0.0982 0.1397 0.1539 0.1382 0.1438 0.1406 0.1493 0.1487 0.1599 0.1421 0.1367 0.1481 0.1382 0.1608 0.1599 0.1612
va: 1.0520 1.0770 2.1482 2.0457 2.0450 2.0713 3.1097 3.6700 3.8099 3.4885 3.9236 3.9488 4.2583 3.9405 3.9688 3.7320 3.9740 3.8635 3.7112 3.5264 3.9606 3.9686 3.6681 4.0842 3.8117 3.9871 4.2361 3.6897 3.9715 3.8453 3.8984 3.9419 3.8798 1.0391 1.0259 1.0019 1.0128 1.0044 1.0043 1.0019 1.0003 1.0023 1.0057 1.0180 1.0066 1.0160 1.0090 1.0096 0.9916 1.0194 0.9739 1.0079 0.9880 0.9882 0.9916 0.9890
dispcorr: -0.036652773 hartree
energy: -1560.142035163261
dipole: 18.56617 -18.92494 -0.35878 -10.01199 7.98192 -2.03007 -26.85681 25.30937 -1.54744
magnitude: 2.57769 au
magnitude: 6.55197 debye
