program: Orca
programVersion: 5.0.2
elementType: F F O O O O N C C C C C C C C C C C C C C C C C C C C C C C C C C H H H H H H H H H H H H H H H H H H H H H H H
charge: 0
multiplicity: 1
keywords: wb97x-d3
keywords: def2-TZVPP
keywords: def2/J RIJCOSX
keywords: DEFGRID2
keywords: scfconv7
keywords: smallprint printgap noloewdin
keywords: NOSOSCF
formula: C26H23F2NO4
InChI: InChI=1/C26H23F2NO4/c1-17(2)24(18-11-13-21(14-12-18)32-26(27)28)25(30)33-23(16-29)19-7-6-10-22(15-19)31-20-8-4-3-5-9-20/h3-15,17,23-24,26H,1-2H3
56 atoms
F  -3.711527 -3.924874 0.61271
F  -4.847241 -2.252373 -0.143617
O  2.719701 0.528719 0.984466
O  4.021275 0.057108 -0.765639
O  -2.740613 -2.33911 -0.616766
O  -1.577792 2.164886 -1.309603
N  2.316812 3.149882 2.962656
C  2.81972 -1.731387 0.363394
C  3.652886 -2.782754 -0.400952
C  1.327218 -1.844922 0.13874
C  3.462466 -4.15457 0.236479
C  3.368636 -2.862075 -1.896082
C  3.272881 -0.316315 0.097628
C  0.706494 -1.299101 -0.984851
C  0.538912 -2.545367 1.042297
C  2.88443 1.918628 0.729201
C  -0.652325 -1.452504 -1.197268
C  -0.821851 -2.732757 0.834306
C  -1.412415 -2.182946 -0.29359
C  1.956319 2.388369 -0.364824
C  0.609454 2.053426 -0.289245
C  2.44907 3.126573 -1.429329
C  -0.250368 2.487409 -1.28618
C  2.562462 2.587968 1.989461
C  1.576416 3.544368 -2.424945
C  0.228645 3.234082 -2.356461
C  -3.650672 -2.594017 0.362799
C  -2.300911 2.039176 -0.149643
C  -3.316701 1.093802 -0.153772
C  -2.091169 2.849958 0.959257
C  -4.126119 0.958054 0.965104
C  -2.896062 2.687489 2.077762
C  -3.913553 1.743695 2.088913
H  2.999155 -1.898294 1.431576
H  4.702197 -2.502623 -0.266102
H  3.706039 -4.143346 1.300137
H  4.11043 -4.88927 -0.243241
H  2.435184 -4.508717 0.131386
H  4.076129 -3.546859 -2.366181
H  2.367422 -3.24813 -2.094114
H  3.462965 -1.902063 -2.401597
H  1.279009 -0.740102 -1.714915
H  0.990652 -2.972172 1.928999
H  3.922234 2.163788 0.483734
H  -1.1200 -1.016757 -2.070767
H  -1.381015 -3.316534 1.552797
H  0.239788 1.462196 0.539624
H  3.501274 3.374155 -1.480466
H  1.947985 4.120201 -3.261641
H  -0.452353 3.563231 -3.13077
H  -3.468178 -2.061238 1.29863
H  -3.479508 0.482546 -1.031933
H  -1.31378 3.602866 0.962443
H  -4.925006 0.229218 0.957335
H  -2.7267 3.31413 2.943174
H  -4.54011 1.626456 2.962651
elementType: F O N C H
totalener: -1560.10581429 hartree
nucrepener: 3461.26904884 hartree
electener: -5021.37486313 hartree
oneelecener: -9013.44315530 hartree
twoeener: 3992.06829217 hartree
cpcmener: -0.04172184 hartree
kineticenergy: 1553.61349084 hartree
xcener: -146.816016652378 hartree
chargesum: 0.0000000
charge: -0.211648 -0.201364 -0.284286 -0.437149 -0.285153 -0.337542 -0.101081 0.132173 0.080180 0.045831 -0.330641 -0.317349 0.355744 -0.255832 -0.250262 0.430478 -0.197036 -0.120833 0.230151 0.051074 -0.273531 -0.204959 0.308080 -0.228902 -0.107438 -0.259227 0.382564 0.342664 -0.276729 -0.223238 -0.121821 -0.139357 -0.196542 0.101560 0.050154 0.098967 0.101852 0.088840 0.106829 0.084113 0.096230 0.148161 0.149470 0.144359 0.151543 0.145161 0.152344 0.150246 0.162810 0.149734 0.134116 0.143551 0.157344 0.162380 0.162416 0.160801
qa: -0.2116 -0.2014 -0.2843 -0.4371 -0.2852 -0.3375 -0.1011 0.1322 0.0802 0.0458 -0.3306 -0.3173 0.3557 -0.2558 -0.2503 0.4305 -0.1970 -0.1208 0.2302 0.0511 -0.2735 -0.2050 0.3081 -0.2289 -0.1074 -0.2592 0.3826 0.3427 -0.2767 -0.2232 -0.1218 -0.1394 -0.1965 0.1016 0.0502 0.0990 0.1019 0.0888 0.1068 0.0841 0.0962 0.1482 0.1495 0.1444 0.1515 0.1452 0.1523 0.1502 0.1628 0.1497 0.1341 0.1436 0.1573 0.1624 0.1624 0.1608
va: 1.0555 1.0676 2.1325 2.0552 2.0375 2.0575 3.1086 3.7302 3.8277 3.4653 3.9439 3.9331 4.2328 3.9199 4.0315 3.7219 3.9320 3.8817 3.8194 3.5577 3.9521 3.9711 3.6563 4.0936 3.8844 4.0423 4.2363 3.6448 3.9557 3.9173 3.8296 3.8881 3.9374 1.0326 1.0224 1.0018 1.0044 0.9994 1.0045 0.9973 1.0162 1.0000 0.9993 1.0170 1.0059 1.0129 1.0064 1.0018 0.9876 1.0052 0.9731 1.0212 0.9977 0.9957 0.9887 0.9903
dispcorr: -0.035838729 hartree
energy: -1560.141653015876
dipole: 23.43637 -22.57919 0.85718 -6.05301 5.64301 -0.41000 -3.94016 3.99768 0.05753
magnitude: 0.95193 au
magnitude: 2.41960 debye
