program: Orca
programVersion: 5.0.2
elementType: F F O O O O N C C C C C C C C C C C C C C C C C C C C C C C C C C H H H H H H H H H H H H H H H H H H H H H H H
charge: 0
multiplicity: 1
keywords: wb97x-d3
keywords: def2-TZVPP
keywords: def2/J RIJCOSX
keywords: DEFGRID2
keywords: scfconv7
keywords: smallprint printgap noloewdin
keywords: NOSOSCF
formula: C26H23F2NO4
InChI: InChI=1/C26H23F2NO4/c1-17(2)24(18-11-13-21(14-12-18)32-26(27)28)25(30)33-23(16-29)19-7-6-10-22(15-19)31-20-8-4-3-5-9-20/h3-15,17,23-24,26H,1-2H3
56 atoms
F  -3.331103 -4.205381 1.028882
F  -3.84334 -2.714894 -0.441605
O  2.631738 0.340937 -0.035949
O  3.847889 -0.593194 1.581188
O  -2.878932 -2.062237 1.472833
O  -1.352444 3.068811 -1.659056
N  2.001815 1.867142 2.95347
C  2.619845 -2.013184 0.048741
C  2.982976 -2.20008 -1.43642
C  1.136868 -2.074278 0.357387
C  4.489688 -2.082771 -1.635688
C  2.485971 -3.555273 -1.921932
C  3.131484 -0.711177 0.620619
C  0.703288 -2.771676 1.47912
C  0.192998 -1.395401 -0.410162
C  2.846288 1.643066 0.484083
C  -0.637993 -2.797943 1.832386
C  -1.14818 -1.400993 -0.06235
C  -1.553224 -2.101803 1.063316
C  2.04972 2.606837 -0.360492
C  0.700361 2.351355 -0.588813
C  2.659437 3.737254 -0.878945
C  -0.038931 3.253516 -1.33711
C  2.380912 1.730914 1.875657
C  1.905142 4.628032 -1.632603
C  0.560901 4.39604 -1.859331
C  -3.750652 -2.926207 0.893263
C  -2.20539 2.32469 -0.881484
C  -2.192696 2.366004 0.507292
C  -3.160094 1.578119 -1.558667
C  -3.142626 1.63985 1.212554
C  -4.114586 0.872669 -0.839904
C  -4.109303 0.89748 0.54769
H  3.119101 -2.804698 0.61417
H  2.495227 -1.421946 -2.029708
H  5.023347 -2.821133 -1.033423
H  4.873091 -1.095454 -1.371048
H  4.750606 -2.256878 -2.680259
H  2.923804 -4.366621 -1.335645
H  1.40134 -3.644752 -1.858988
H  2.767256 -3.711138 -2.964422
H  1.420964 -3.305717 2.089298
H  0.492031 -0.846614 -1.293375
H  3.908606 1.904449 0.467606
H  -0.960826 -3.337941 2.712597
H  -1.859509 -0.840512 -0.654456
H  0.23809 1.459651 -0.183977
H  3.710014 3.923283 -0.698286
H  2.369197 5.513739 -2.044376
H  -0.026388 5.091773 -2.444394
H  -4.728583 -2.804203 1.354024
H  -1.462488 2.958003 1.043704
H  -3.161378 1.559836 -2.64089
H  -3.13012 1.669786 2.294088
H  -4.862671 0.299774 -1.371658
H  -4.851887 0.343878 1.106389
elementType: F O N C H
totalener: -1560.10493736 hartree
nucrepener: 3459.99851750 hartree
electener: -5020.10345486 hartree
oneelecener: -9011.86827347 hartree
twoeener: 3991.76481861 hartree
cpcmener: -0.04543716 hartree
kineticenergy: 1553.63185455 hartree
xcener: -146.817654721032 hartree
chargesum: -0.0000000
charge: -0.213815 -0.214643 -0.268444 -0.437504 -0.342775 -0.329672 -0.101162 0.177357 0.029165 0.010892 -0.298558 -0.300034 0.334978 -0.182439 -0.278125 0.414456 -0.160457 -0.150601 0.215679 -0.007107 -0.255422 -0.204791 0.317245 -0.227130 -0.102377 -0.252894 0.424542 0.313932 -0.210411 -0.244246 -0.142756 -0.118975 -0.202824 0.096243 0.059215 0.094821 0.092643 0.095500 0.091889 0.099740 0.097582 0.142029 0.153566 0.140077 0.151118 0.166367 0.152724 0.149456 0.161843 0.148270 0.133710 0.159789 0.144375 0.160566 0.155792 0.161599
qa: -0.2138 -0.2146 -0.2684 -0.4375 -0.3428 -0.3297 -0.1012 0.1774 0.0292 0.0109 -0.2986 -0.3000 0.3350 -0.1824 -0.2781 0.4145 -0.1605 -0.1506 0.2157 -0.0071 -0.2554 -0.2048 0.3172 -0.2271 -0.1024 -0.2529 0.4245 0.3139 -0.2104 -0.2442 -0.1428 -0.1190 -0.2028 0.0962 0.0592 0.0948 0.0926 0.0955 0.0919 0.0997 0.0976 0.1420 0.1536 0.1401 0.1511 0.1664 0.1527 0.1495 0.1618 0.1483 0.1337 0.1598 0.1444 0.1606 0.1558 0.1616
va: 1.0653 1.0594 2.1540 2.0589 2.0339 2.0926 3.1055 3.6173 3.8395 3.5240 3.9383 3.9268 4.2165 4.0072 3.9960 3.7436 4.0268 3.9349 3.7161 3.7507 3.9613 3.9443 3.7182 4.0300 3.8853 3.9999 4.2268 3.6289 3.8803 3.9727 3.8390 3.8388 3.8477 1.0306 1.0224 1.0030 1.0089 1.0037 1.0019 1.0011 1.0050 1.0033 1.0068 1.0131 1.0015 0.9923 1.0013 1.0017 0.9881 1.0069 0.9756 0.9965 1.0097 0.9903 0.9936 0.9903
dispcorr: -0.035269741 hartree
energy: -1560.140207104353
dipole: 20.25452 -20.15673 0.09779 -1.31730 1.38553 0.06822 -12.95675 10.83584 -2.12091
magnitude: 2.12426 au
magnitude: 5.39944 debye
