program: Orca
programVersion: 5.0.2
elementType: F F O O O O N C C C C C C C C C C C C C C C C C C C C C C C C C C H H H H H H H H H H H H H H H H H H H H H H H
charge: 0
multiplicity: 1
keywords: wb97x-d3
keywords: def2-TZVPP
keywords: def2/J RIJCOSX
keywords: DEFGRID2
keywords: scfconv7
keywords: smallprint printgap noloewdin
keywords: NOSOSCF
formula: C26H23F2NO4
InChI: InChI=1/C26H23F2NO4/c1-17(2)24(18-11-13-21(14-12-18)32-26(27)28)25(30)33-23(16-29)19-7-6-10-22(15-19)31-20-8-4-3-5-9-20/h3-15,17,23-24,26H,1-2H3
56 atoms
F  -4.07181 -1.720577 -0.557068
F  -3.144455 -3.573825 -1.173636
O  2.745698 0.549943 1.029888
O  3.966183 -0.159248 -0.705402
O  -2.321318 -1.647385 -1.957342
O  -2.121787 1.407209 -0.472701
N  2.337858 3.485368 2.492105
C  2.739529 -1.76694 0.623935
C  3.682032 -2.910707 0.230314
C  1.374827 -1.81581 -0.040954
C  5.001188 -2.80184 0.986585
C  3.025128 -4.255273 0.516447
C  3.265612 -0.40624 0.240661
C  0.212856 -1.857341 0.718856
C  1.255844 -1.744971 -1.427014
C  2.669508 1.862222 0.472641
C  -1.044994 -1.827701 0.12914
C  0.011377 -1.720321 -2.030734
C  -1.136352 -1.751745 -1.252379
C  1.503454 1.927523 -0.48274
C  0.222969 1.682152 0.001903
C  1.721064 2.130086 -1.837746
C  -0.84441 1.668481 -0.881688
C  2.491282 2.761011 1.612008
C  0.643218 2.0919 -2.712398
C  -0.639882 1.866148 -2.24187
C  -3.439187 -2.327004 -1.594257
C  -2.565943 1.896202 0.73151
C  -2.281899 3.191124 1.148744
C  -3.367851 1.064506 1.498616
C  -2.802372 3.643082 2.352774
C  -3.891331 1.534679 2.694842
C  -3.606942 2.820924 3.131018
H  2.591547 -1.793392 1.707719
H  3.884813 -2.848017 -0.843037
H  5.528193 -1.868156 0.786915
H  5.670915 -3.616038 0.707336
H  4.836912 -2.866302 2.064629
H  3.709303 -5.0704 0.277912
H  2.758588 -4.346602 1.571939
H  2.119627 -4.406364 -0.071529
H  0.280536 -1.902679 1.798665
H  2.136723 -1.707826 -2.055414
H  3.600023 2.148478 -0.026169
H  -1.91831 -1.836655 0.765685
H  -0.06987 -1.659546 -3.108211
H  0.061636 1.500278 1.058474
H  2.721236 2.312115 -2.208413
H  0.803262 2.243279 -3.771362
H  -1.48076 1.841264 -2.922998
H  -4.116041 -2.365679 -2.44518
H  -1.66561 3.846654 0.546507
H  -3.590875 0.062818 1.157835
H  -2.579445 4.650455 2.678994
H  -4.520563 0.884652 3.288677
H  -4.011175 3.181728 4.06713
elementType: F O N C H
totalener: -1560.10353094 hartree
nucrepener: 3514.87126564 hartree
electener: -5074.97479658 hartree
oneelecener: -9122.21565854 hartree
twoeener: 4047.24086196 hartree
cpcmener: -0.04097565 hartree
kineticenergy: 1553.62815984 hartree
xcener: -146.817382318944 hartree
chargesum: -0.0000000
charge: -0.212268 -0.211282 -0.286523 -0.437621 -0.331623 -0.340834 -0.099498 0.133174 0.063921 -0.028537 -0.293390 -0.314145 0.332953 -0.189498 -0.183866 0.436783 -0.168040 -0.226779 0.291919 0.046108 -0.218888 -0.196755 0.275380 -0.236445 -0.103650 -0.262409 0.429019 0.293000 -0.187640 -0.249223 -0.155356 -0.146787 -0.176629 0.098281 0.045466 0.094344 0.093896 0.089694 0.099005 0.090574 0.097201 0.140455 0.142206 0.141981 0.144909 0.147185 0.145125 0.148475 0.160529 0.146399 0.140249 0.153348 0.154440 0.161839 0.159053 0.160773
qa: -0.2123 -0.2113 -0.2865 -0.4376 -0.3316 -0.3408 -0.0995 0.1332 0.0639 -0.0285 -0.2934 -0.3141 0.3330 -0.1895 -0.1839 0.4368 -0.1680 -0.2268 0.2919 0.0461 -0.2189 -0.1968 0.2754 -0.2364 -0.1037 -0.2624 0.4290 0.2930 -0.1876 -0.2492 -0.1554 -0.1468 -0.1766 0.0983 0.0455 0.0943 0.0939 0.0897 0.0990 0.0906 0.0972 0.1405 0.1422 0.1420 0.1449 0.1472 0.1451 0.1485 0.1605 0.1464 0.1402 0.1533 0.1544 0.1618 0.1591 0.1608
va: 1.0662 1.0734 2.1478 2.0538 2.0648 2.0224 3.1080 3.6662 3.8084 3.5025 3.9262 3.9511 4.2751 3.9874 3.9218 3.7293 3.9082 3.9819 3.5867 3.5810 3.9400 3.9318 3.6141 4.0946 3.8719 3.9998 4.2339 3.6941 3.9067 3.9561 3.8925 3.9288 3.8951 1.0388 1.0269 1.0125 1.0044 1.0019 1.0042 1.0019 1.0006 1.0052 1.0180 1.0164 1.0142 1.0062 1.0168 1.0055 0.9879 1.0076 0.9725 0.9989 1.0160 0.9893 0.9914 0.9891
dispcorr: -0.037130720 hartree
energy: -1560.140661657505
dipole: 22.47982 -22.67037 -0.19055 -7.69054 6.69065 -0.99989 6.10454 -7.16369 -1.05914
magnitude: 1.46897 au
magnitude: 3.73382 debye
