program: Orca
programVersion: 5.0.2
elementType: F F O O O O N C C C C C C C C C C C C C C C C C C C C C C C C C C H H H H H H H H H H H H H H H H H H H H H H H
charge: 0
multiplicity: 1
keywords: wb97x-d3
keywords: def2-TZVPP
keywords: def2/J RIJCOSX
keywords: DEFGRID2
keywords: scfconv7
keywords: smallprint printgap noloewdin
keywords: NOSOSCF
formula: C26H23F2NO4
InChI: InChI=1/C26H23F2NO4/c1-17(2)24(18-11-13-21(14-12-18)32-26(27)28)25(30)33-23(16-29)19-7-6-10-22(15-19)31-20-8-4-3-5-9-20/h3-15,17,23-24,26H,1-2H3
56 atoms
F  -2.277609 -1.355121 -3.046491
F  -3.148844 -0.615731 -1.215423
O  3.00861 0.382408 0.700193
O  4.014173 -0.670533 -1.008899
O  -2.343086 -2.702419 -1.261527
O  -1.56049 3.193832 1.006828
N  3.89917 3.435014 1.600666
C  2.930749 -1.959876 0.726807
C  3.859146 -3.163852 0.522595
C  1.523677 -2.13709 0.182132
C  5.21631 -2.90216 1.166832
C  3.234206 -4.42181 1.112822
C  3.420995 -0.710285 0.036981
C  0.421625 -1.800769 0.960013
C  1.311477 -2.596334 -1.11573
C  2.932248 1.620882 -0.009387
C  -0.869906 -1.945996 0.471984
C  0.0279 -2.752148 -1.613267
C  -1.055664 -2.437595 -0.808579
C  1.491963 1.840426 -0.394851
C  0.598558 2.441306 0.481325
C  1.043755 1.304046 -1.596928
C  -0.741618 2.529008 0.135301
C  3.46361 2.639385 0.894072
C  -0.302053 1.382411 -1.919504
C  -1.201224 2.00197 -1.06474
C  -2.990688 -1.735313 -1.960074
C  -2.850252 2.752338 1.192687
C  -3.135371 1.409476 1.404795
C  -3.854798 3.707768 1.218704
C  -4.449336 1.026298 1.632206
C  -5.162915 3.311372 1.461923
C  -5.466447 1.971831 1.66257
H  2.85465 -1.759844 1.799465
H  4.008703 -3.32285 -0.549173
H  5.113428 -2.750915 2.243688
H  5.717034 -2.025251 0.754218
H  5.880892 -3.753608 1.015421
H  3.023346 -4.294606 2.177232
H  2.301878 -4.694393 0.618104
H  3.916225 -5.266898 1.010837
H  0.567552 -1.431732 1.967429
H  2.149787 -2.852254 -1.751134
H  3.569787 1.609904 -0.897415
H  -1.718884 -1.709746 1.100131
H  -0.122658 -3.145866 -2.609579
H  0.926979 2.848636 1.43053
H  1.73937 0.828361 -2.276132
H  -0.65499 0.972674 -2.855634
H  -2.244177 2.08093 -1.341619
H  -3.9625 -2.11359 -2.268391
H  -2.345175 0.668467 1.40077
H  -3.615197 4.750741 1.055048
H  -4.675061 -0.019381 1.7952
H  -5.947563 4.056209 1.485034
H  -6.488345 1.666362 1.843181
elementType: F O N C H
totalener: -1560.10485125 hartree
nucrepener: 3451.40058273 hartree
electener: -5011.50543397 hartree
oneelecener: -8994.46092747 hartree
twoeener: 3982.95549350 hartree
cpcmener: -0.04101846 hartree
kineticenergy: 1553.61792203 hartree
xcener: -146.809808533226 hartree
chargesum: -0.0000000
charge: -0.217408 -0.208514 -0.277112 -0.442524 -0.341301 -0.340360 -0.099652 0.139318 0.060069 0.021898 -0.296818 -0.309583 0.346506 -0.211622 -0.212515 0.413703 -0.202981 -0.167879 0.249892 0.011155 -0.224982 -0.203283 0.266875 -0.218713 -0.152690 -0.171950 0.417055 0.269486 -0.179447 -0.229066 -0.180347 -0.139986 -0.166286 0.099424 0.046457 0.090370 0.095297 0.094267 0.091797 0.099131 0.097286 0.141304 0.145778 0.137640 0.162622 0.150374 0.127608 0.151640 0.160631 0.153741 0.150743 0.171231 0.148288 0.160273 0.161347 0.161809
qa: -0.2174 -0.2085 -0.2771 -0.4425 -0.3413 -0.3404 -0.0997 0.1393 0.0601 0.0219 -0.2968 -0.3096 0.3465 -0.2116 -0.2125 0.4137 -0.2030 -0.1679 0.2499 0.0112 -0.2250 -0.2033 0.2669 -0.2187 -0.1527 -0.1719 0.4171 0.2695 -0.1794 -0.2291 -0.1803 -0.1400 -0.1663 0.0994 0.0465 0.0904 0.0953 0.0943 0.0918 0.0991 0.0973 0.1413 0.1458 0.1376 0.1626 0.1504 0.1276 0.1516 0.1606 0.1537 0.1507 0.1712 0.1483 0.1603 0.1613 0.1618
va: 1.0638 1.0724 2.1317 2.0510 2.0652 2.0659 3.1074 3.6377 3.8074 3.4487 3.9303 3.9448 4.2438 3.9568 3.9445 3.7178 3.9563 4.0179 3.6907 3.6831 4.0950 3.8809 3.7860 4.0811 3.8492 3.8684 4.2156 3.6979 3.8684 3.9935 3.9154 3.8859 3.8849 1.0364 1.0278 1.0024 1.0112 1.0041 1.0022 1.0005 1.0043 1.0077 1.0123 1.0253 0.9884 1.0032 1.0285 1.0088 1.0024 1.0053 0.9718 0.9834 1.0064 0.9928 0.9880 0.9884
dispcorr: -0.035307899 hartree
energy: -1560.140159145411
dipole: 14.28634 -16.12442 -1.83807 -17.06113 14.87558 -2.18555 10.78333 -11.40730 -0.62398
magnitude: 2.92310 au
magnitude: 7.42992 debye
