program: Orca
programVersion: 5.0.2
elementType: F F O O O O N C C C C C C C C C C C C C C C C C C C C C C C C C C H H H H H H H H H H H H H H H H H H H H H H H
charge: 0
multiplicity: 1
keywords: wb97x-d3
keywords: def2-TZVPP
keywords: def2/J RIJCOSX
keywords: DEFGRID2
keywords: scfconv7
keywords: smallprint printgap noloewdin
keywords: NOSOSCF
formula: C26H23F2NO4
InChI: InChI=1/C26H23F2NO4/c1-17(2)24(18-11-13-21(14-12-18)32-26(27)28)25(30)33-23(16-29)19-7-6-10-22(15-19)31-20-8-4-3-5-9-20/h3-15,17,23-24,26H,1-2H3
56 atoms
F  -4.786299 -1.735785 1.029212
F  -3.644549 -3.10485 -0.201021
O  3.392147 0.356813 0.683149
O  3.230033 0.017862 -1.519167
O  -2.647053 -1.744794 1.253149
O  -1.407514 1.733976 0.813607
N  4.261232 2.795225 2.719355
C  2.888705 -1.835974 0.004584
C  3.336152 -2.86913 -1.038486
C  1.400145 -1.831708 0.294108
C  4.854483 -2.85555 -1.182386
C  2.862448 -4.260422 -0.637254
C  3.208931 -0.417637 -0.398385
C  0.940826 -1.945808 1.60162
C  0.464216 -1.672414 -0.721615
C  3.439482 1.758213 0.465968
C  -0.412705 -1.914216 1.888471
C  -0.898244 -1.651439 -0.45562
C  -1.331108 -1.768146 0.85879
C  2.089108 2.341192 0.107948
C  0.925614 1.769094 0.605541
C  2.031712 3.464833 -0.703245
C  -0.299358 2.327397 0.275172
C  3.902667 2.323717 1.733654
C  0.799062 4.028812 -0.999212
C  -0.371974 3.47008 -0.512775
C  -3.647049 -1.859817 0.333333
C  -2.55562 1.610113 0.074046
C  -2.542176 1.373006 -1.295611
C  -3.754369 1.668801 0.771208
C  -3.746903 1.211723 -1.965862
C  -4.949816 1.493437 0.089266
C  -4.953856 1.270941 -1.281275
H  3.409651 -2.050954 0.942466
H  2.888242 -2.617978 -2.004518
H  5.334993 -3.113742 -0.23605
H  5.241455 -1.885686 -1.497001
H  5.176233 -3.586907 -1.924585
H  3.239714 -4.534303 0.350706
H  1.775398 -4.33764 -0.612507
H  3.226432 -5.004436 -1.346716
H  1.648005 -2.066027 2.412639
H  0.785905 -1.569647 -1.750703
H  4.177425 2.020163 -0.299386
H  -0.758559 -2.008664 2.90973
H  -1.583348 -1.539686 -1.284747
H  0.951604 0.894952 1.244696
H  2.941392 3.898747 -1.098212
H  0.746688 4.912923 -1.62008
H  -1.326269 3.921605 -0.751087
H  -3.622734 -1.12672 -0.474662
H  -1.609829 1.307272 -1.841475
H  -3.749383 1.846397 1.839159
H  -3.735561 1.028973 -3.032383
H  -5.882562 1.538626 0.635692
H  -5.888067 1.140465 -1.810773
elementType: F O N C H
totalener: -1560.10773433 hartree
nucrepener: 3488.10992878 hartree
electener: -5048.21766311 hartree
oneelecener: -9067.27131174 hartree
twoeener: 4019.05364863 hartree
cpcmener: -0.04309066 hartree
kineticenergy: 1553.62426314 hartree
xcener: -146.821033290222 hartree
chargesum: -0.0000000
charge: -0.198786 -0.210819 -0.278513 -0.442159 -0.290462 -0.335715 -0.098929 0.137556 0.065779 -0.042180 -0.295217 -0.314240 0.338965 -0.173397 -0.198170 0.384541 -0.193775 -0.185822 0.274076 0.030076 -0.261359 -0.201508 0.267694 -0.224321 -0.122496 -0.199230 0.414767 0.331907 -0.215831 -0.261373 -0.137638 -0.133110 -0.179086 0.097770 0.047673 0.090355 0.094266 0.094328 0.091204 0.098019 0.097593 0.138185 0.142975 0.150953 0.145504 0.145440 0.166703 0.147060 0.163803 0.160174 0.097418 0.157441 0.144824 0.159448 0.158588 0.159053
qa: -0.1988 -0.2108 -0.2785 -0.4422 -0.2905 -0.3357 -0.0989 0.1376 0.0658 -0.0422 -0.2952 -0.3142 0.3390 -0.1734 -0.1982 0.3845 -0.1938 -0.1858 0.2741 0.0301 -0.2614 -0.2015 0.2677 -0.2243 -0.1225 -0.1992 0.4148 0.3319 -0.2158 -0.2614 -0.1376 -0.1331 -0.1791 0.0978 0.0477 0.0904 0.0943 0.0943 0.0912 0.0980 0.0976 0.1382 0.1430 0.1510 0.1455 0.1454 0.1667 0.1471 0.1638 0.1602 0.0974 0.1574 0.1448 0.1594 0.1586 0.1591
va: 1.0735 1.0634 2.1434 2.0494 2.0398 2.0283 3.1112 3.6760 3.8008 3.4589 3.9262 3.9504 4.2150 3.9838 3.9723 3.7282 3.9970 3.9168 3.6850 3.6281 4.0255 3.9808 3.7742 4.0841 3.8801 3.9260 4.2679 3.4908 3.8465 3.9923 3.8730 3.8280 3.8761 1.0381 1.0264 1.0020 1.0124 1.0041 1.0019 1.0002 1.0045 1.0047 1.0172 1.0135 1.0063 0.9981 0.9996 1.0008 0.9887 0.9947 0.9809 1.0010 1.0099 0.9911 0.9892 0.9907
dispcorr: -0.036867183 hartree
energy: -1560.144601513189
dipole: 20.50680 -20.68635 -0.17955 -7.74894 7.67440 -0.07454 -12.91451 10.86852 -2.04599
magnitude: 2.05520 au
magnitude: 5.22390 debye
