program: Orca
programVersion: 5.0.2
elementType: F F O O O O N C C C C C C C C C C C C C C C C C C C C C C C C C C H H H H H H H H H H H H H H H H H H H H H H H
charge: 0
multiplicity: 1
keywords: wb97x-d3
keywords: def2-TZVPP
keywords: def2/J RIJCOSX
keywords: DEFGRID2
keywords: scfconv7
keywords: smallprint printgap noloewdin
keywords: NOSOSCF
formula: C26H23F2NO4
InChI: InChI=1/C26H23F2NO4/c1-17(2)24(18-11-13-21(14-12-18)32-26(27)28)25(30)33-23(16-29)19-7-6-10-22(15-19)31-20-8-4-3-5-9-20/h3-15,17,23-24,26H,1-2H3
56 atoms
F  -3.646716 -1.388816 1.884364
F  -3.513296 -3.369409 1.02388
O  3.29587 0.303287 0.704728
O  3.428665 0.013096 -1.506754
O  -2.878946 -1.618084 -0.20968
O  -1.455718 1.814161 0.7237
N  4.056822 2.676983 2.859744
C  2.799098 -1.85119 -0.093323
C  3.402962 -2.889695 -1.050037
C  1.282625 -1.812606 -0.099039
C  4.92397 -2.902331 -0.936151
C  2.842926 -4.272261 -0.739474
C  3.232828 -0.441731 -0.410115
C  0.564138 -2.042117 1.065553
C  0.572289 -1.52356 -1.262199
C  3.384361 1.709876 0.527482
C  -0.825008 -1.994706 1.093086
C  -0.80971 -1.481707 -1.256999
C  -1.510821 -1.71444 -0.080198
C  2.06765 2.306444 0.083174
C  0.87541 1.783793 0.568186
C  2.061534 3.380829 -0.793363
C  -0.326325 2.348446 0.171061
C  3.761217 2.23638 1.839711
C  0.850494 3.948588 -1.164122
C  -0.347968 3.444359 -0.684192
C  -3.751197 -2.073285 0.720056
C  -2.610363 1.672563 -0.001224
C  -3.7915 1.681437 0.727894
C  -2.625058 1.452544 -1.372848
C  -4.996311 1.456624 0.079424
C  -3.839397 1.235686 -2.008576
C  -5.027888 1.232941 -1.290961
H  3.126238 -2.090989 0.922802
H  3.128159 -2.627705 -2.076216
H  5.236474 -3.155186 0.079564
H  5.375717 -1.943203 -1.19254
H  5.351804 -3.648176 -1.607209
H  3.301839 -5.021856 -1.385299
H  3.049227 -4.557125 0.295078
H  1.764688 -4.326702 -0.891136
H  1.091391 -2.263369 1.985343
H  1.092157 -1.332769 -2.192734
H  4.180112 1.979835 -0.174487
H  -1.322033 -2.172679 2.035062
H  -1.349582 -1.265134 -2.16971
H  0.863455 0.946598 1.255882
H  2.992699 3.775135 -1.179551
H  0.836637 4.795058 -1.837418
H  -1.283037 3.90366 -0.977289
H  -4.759879 -1.964601 0.326641
H  -3.764222 1.853679 1.796454
H  -1.708357 1.429221 -1.947138
H  -5.914733 1.460237 0.651708
H  -3.849529 1.058523 -3.07612
H  -5.969361 1.059114 -1.794621
elementType: F O N C H
totalener: -1560.10535311 hartree
nucrepener: 3498.15319846 hartree
electener: -5058.25855157 hartree
oneelecener: -9088.54911336 hartree
twoeener: 4030.29056180 hartree
cpcmener: -0.04198495 hartree
kineticenergy: 1553.63192669 hartree
xcener: -146.820590622611 hartree
chargesum: -0.0000000
charge: -0.217401 -0.214948 -0.280029 -0.443583 -0.309827 -0.334371 -0.098667 0.142955 0.063558 -0.048313 -0.293998 -0.315497 0.337014 -0.225103 -0.154337 0.398900 -0.137349 -0.229127 0.269245 0.045149 -0.271839 -0.202341 0.273728 -0.225255 -0.125000 -0.202160 0.436912 0.407996 -0.317746 -0.260343 -0.102495 -0.136824 -0.203089 0.095576 0.047339 0.090292 0.094815 0.094184 0.099121 0.091022 0.097543 0.140677 0.142000 0.148603 0.136801 0.150449 0.154003 0.148198 0.163846 0.161812 0.138203 0.142648 0.156187 0.159564 0.160914 0.160387
qa: -0.2174 -0.2149 -0.2800 -0.4436 -0.3098 -0.3344 -0.0987 0.1430 0.0636 -0.0483 -0.2940 -0.3155 0.3370 -0.2251 -0.1543 0.3989 -0.1373 -0.2291 0.2692 0.0451 -0.2718 -0.2023 0.2737 -0.2253 -0.1250 -0.2022 0.4369 0.4080 -0.3177 -0.2603 -0.1025 -0.1368 -0.2031 0.0956 0.0473 0.0903 0.0948 0.0942 0.0991 0.0910 0.0975 0.1407 0.1420 0.1486 0.1368 0.1504 0.1540 0.1482 0.1638 0.1618 0.1382 0.1426 0.1562 0.1596 0.1609 0.1604
va: 1.0533 1.0720 2.1404 2.0472 2.0962 2.0423 3.1110 3.6780 3.8064 3.4904 3.9253 3.9516 4.2219 3.9987 3.9468 3.7204 3.9426 3.9852 3.6914 3.6173 4.0380 3.9858 3.7497 4.0868 3.8831 3.9281 4.2193 3.4348 3.9950 3.8712 3.8269 3.8898 3.9082 1.0398 1.0260 1.0020 1.0122 1.0041 1.0044 1.0018 1.0000 1.0056 1.0183 1.0152 1.0304 1.0004 1.0118 1.0008 0.9888 0.9938 0.9753 1.0128 0.9979 0.9883 0.9899 0.9897
dispcorr: -0.036939123 hartree
energy: -1560.142292234762
dipole: 17.60417 -18.56294 -0.95877 -8.79741 8.16278 -0.63463 -15.06517 13.22431 -1.84085
magnitude: 2.17043 au
magnitude: 5.51678 debye
