program: Orca
programVersion: 5.0.2
elementType: F F O O O O N C C C C C C C C C C C C C C C C C C C C C C C C C C H H H H H H H H H H H H H H H H H H H H H H H
charge: 0
multiplicity: 1
keywords: wb97x-d3
keywords: def2-TZVPP
keywords: def2/J RIJCOSX
keywords: DEFGRID2
keywords: scfconv7
keywords: smallprint printgap noloewdin
keywords: NOSOSCF
formula: C26H23F2NO4
InChI: InChI=1/C26H23F2NO4/c1-17(2)24(18-11-13-21(14-12-18)32-26(27)28)25(30)33-23(16-29)19-7-6-10-22(15-19)31-20-8-4-3-5-9-20/h3-15,17,23-24,26H,1-2H3
56 atoms
F  -3.54647 -3.71093 -0.322962
F  -2.729191 -3.768717 -2.315643
O  2.717039 0.542591 1.053691
O  3.646626 -0.22753 -0.825418
O  -2.906766 -1.792595 -1.283425
O  -1.827343 2.066502 -0.770943
N  2.788154 3.429879 2.683281
C  2.441681 -1.749042 0.621521
C  3.245117 -2.963259 0.131583
C  1.013002 -1.726038 0.113248
C  4.640689 -2.968125 0.746427
C  2.513996 -4.255217 0.478206
C  3.03776 -0.433219 0.189089
C  -0.052197 -1.756831 1.004989
C  0.743309 -1.675076 -1.252236
C  2.892673 1.873842 0.588433
C  -1.362829 -1.783953 0.551151
C  -0.560216 -1.700943 -1.71908
C  -1.604621 -1.770889 -0.811784
C  1.810252 2.263361 -0.392069
C  0.485651 1.964432 -0.092943
C  2.143917 2.916062 -1.568982
C  -0.510171 2.350993 -0.978331
C  2.826626 2.723605 1.7786
C  1.136842 3.286252 -2.449136
C  -0.189214 3.013659 -2.157102
C  -3.473665 -3.008756 -1.478762
C  -2.368731 2.111065 0.485661
C  -1.987599 3.052628 1.434317
C  -3.377796 1.198564 0.761723
C  -2.606829 3.050667 2.67609
C  -3.996037 1.217591 2.003365
C  -3.607282 2.134388 2.969887
H  2.411366 -1.771781 1.715151
H  3.340612 -2.904783 -0.956968
H  5.216841 -2.076454 0.495451
H  5.211793 -3.828385 0.393977
H  4.586907 -3.033762 1.835701
H  3.098442 -5.119566 0.159144
H  2.355469 -4.344742 1.555868
H  1.540447 -4.325493 -0.007707
H  0.138235 -1.776575 2.070829
H  1.551504 -1.629947 -1.971563
H  3.881926 2.015621 0.141051
H  -2.182388 -1.808202 1.257146
H  -0.75946 -1.661246 -2.782044
H  0.233818 1.443853 0.823333
H  3.179417 3.133915 -1.79748
H  1.385884 3.796651 -3.370004
H  -0.975991 3.308899 -2.839791
H  -4.471872 -2.869738 -1.889857
H  -1.217347 3.782562 1.219855
H  -3.676872 0.481711 0.008281
H  -2.303439 3.779378 3.416585
H  -4.78129 0.503341 2.214883
H  -4.084001 2.139473 3.941091
elementType: F O N C H
totalener: -1560.11917907 hartree
nucrepener: 3466.53092644 hartree
electener: -5026.65010551 hartree
oneelecener: -9025.08546102 hartree
twoeener: 3998.43535551 hartree
cpcmener: -0.03540024 hartree
kineticenergy: 1553.66540795 hartree
xcener: -146.819684948502 hartree
chargesum: -0.0000000
charge: -0.212880 -0.212097 -0.283689 -0.415382 -0.338948 -0.328896 -0.085910 0.144181 0.058734 -0.035715 -0.293018 -0.310841 0.315155 -0.169168 -0.150303 0.408923 -0.180497 -0.219783 0.268314 0.071750 -0.258956 -0.200336 0.275729 -0.233029 -0.110088 -0.243059 0.420750 0.313992 -0.195352 -0.285806 -0.147757 -0.124730 -0.179327 0.095633 0.047278 0.095318 0.093930 0.089023 0.098917 0.089423 0.098126 0.137776 0.140453 0.143467 0.146947 0.148385 0.149871 0.145295 0.159278 0.147885 0.128308 0.153286 0.157110 0.158523 0.156338 0.157470
qa: -0.2129 -0.2121 -0.2837 -0.4154 -0.3389 -0.3289 -0.0859 0.1442 0.0587 -0.0357 -0.2930 -0.3108 0.3152 -0.1692 -0.1503 0.4089 -0.1805 -0.2198 0.2683 0.0717 -0.2590 -0.2003 0.2757 -0.2330 -0.1101 -0.2431 0.4208 0.3140 -0.1954 -0.2858 -0.1478 -0.1247 -0.1793 0.0956 0.0473 0.0953 0.0939 0.0890 0.0989 0.0894 0.0981 0.1378 0.1405 0.1435 0.1469 0.1484 0.1499 0.1453 0.1593 0.1479 0.1283 0.1533 0.1571 0.1585 0.1563 0.1575
va: 1.0642 1.0665 2.1425 2.0826 2.0236 2.0602 3.1117 3.6730 3.8138 3.4796 3.9269 3.9501 4.2708 3.9064 3.9042 3.7309 3.9787 4.0867 3.6022 3.5675 3.9535 3.9777 3.6534 4.0857 3.8976 4.0444 4.2485 3.6630 3.8973 3.9426 3.8955 3.8864 3.9107 1.0386 1.0267 1.0124 1.0044 1.0022 1.0046 1.0025 1.0007 1.0049 1.0174 1.0173 1.0059 1.0046 1.0074 1.0026 0.9890 1.0054 0.9751 0.9986 1.0150 0.9903 0.9908 0.9900
dispcorr: -0.035051761 hartree
energy: -1560.154230834880
dipole: 18.75246 -19.08239 -0.32994 -4.62249 3.94447 -0.67803 7.38560 -7.96987 -0.58427
magnitude: 0.95391 au
magnitude: 2.42466 debye
