program: Orca
programVersion: 5.0.2
elementType: F F O O O O N C C C C C C C C C C C C C C C C C C C C C C C C C C H H H H H H H H H H H H H H H H H H H H H H H
charge: 0
multiplicity: 1
keywords: wb97x-d3
keywords: def2-TZVPP
keywords: def2/J RIJCOSX
keywords: DEFGRID2
keywords: scfconv7
keywords: smallprint printgap noloewdin
keywords: NOSOSCF
formula: C26H23F2NO4
InChI: InChI=1/C26H23F2NO4/c1-17(2)24(18-11-13-21(14-12-18)32-26(27)28)25(30)33-23(16-29)19-7-6-10-22(15-19)31-20-8-4-3-5-9-20/h3-15,17,23-24,26H,1-2H3
56 atoms
F  -3.446883 -3.706043 -0.716326
F  -2.738263 -3.40389 -2.728589
O  2.716622 0.537771 1.089245
O  3.707532 -0.213607 -0.766064
O  -2.815492 -1.651478 -1.335455
O  -1.966343 1.859829 -0.576159
N  2.593634 3.431878 2.68032
C  2.507531 -1.761489 0.655794
C  3.348319 -2.955803 0.181372
C  1.087108 -1.755133 0.119406
C  4.739992 -2.917495 0.805126
C  2.65043 -4.263412 0.5365
C  3.081254 -0.431228 0.235371
C  0.00355 -1.811576 0.98825
C  0.84137 -1.661211 -1.248506
C  2.800365 1.871503 0.596351
C  -1.298578 -1.806167 0.508448
C  -0.453589 -1.64221 -1.740457
C  -1.517455 -1.720467 -0.855957
C  1.68079 2.138469 -0.381498
C  0.372085 1.881823 0.013058
C  1.96155 2.583594 -1.663842
C  -0.662014 2.108212 -0.882405
C  2.685509 2.730366 1.775671
C  0.916264 2.788094 -2.554506
C  -0.393838 2.559405 -2.169506
C  -3.416847 -2.802662 -1.722481
C  -2.44311 2.081492 0.68828
C  -2.056566 3.177775 1.450699
C  -3.392666 1.1884 1.164308
C  -2.614779 3.357962 2.707985
C  -3.950961 1.389247 2.418403
C  -3.559832 2.467518 3.199467
H  2.456086 -1.786386 1.748685
H  3.449782 -2.904531 -0.907017
H  5.298055 -2.018126 0.541708
H  5.332605 -3.770556 0.471301
H  4.681595 -2.965422 1.895055
H  3.263909 -5.11541 0.23969
H  2.479088 -4.341455 1.61306
H  1.686562 -4.368392 0.037761
H  0.172221 -1.870256 2.056473
H  1.662614 -1.599455 -1.95153
H  3.772811 2.073021 0.136671
H  -2.131866 -1.850416 1.197752
H  -0.627675 -1.54793 -2.804069
H  0.163984 1.51326 1.010786
H  2.984075 2.767918 -1.96702
H  1.123172 3.134301 -3.558392
H  -1.209635 2.727407 -2.861171
H  -4.431019 -2.57656 -2.045915
H  -1.33092 3.889913 1.07774
H  -3.696248 0.34708 0.554371
H  -2.308535 4.208671 3.302917
H  -4.691859 0.691132 2.786435
H  -3.991327 2.616756 4.180324
elementType: F O N C H
totalener: -1560.11927729 hartree
nucrepener: 3476.30293399 hartree
electener: -5036.42221128 hartree
oneelecener: -9044.74564385 hartree
twoeener: 4008.32343258 hartree
cpcmener: -0.03554854 hartree
kineticenergy: 1553.65682428 hartree
xcener: -146.817896255403 hartree
chargesum: -0.0000000
charge: -0.212821 -0.213200 -0.282562 -0.414243 -0.340399 -0.328784 -0.085511 0.140464 0.060829 -0.024507 -0.292744 -0.311802 0.312420 -0.170706 -0.171218 0.422720 -0.180659 -0.202173 0.269424 0.060878 -0.248554 -0.191414 0.264407 -0.237754 -0.105804 -0.247729 0.417899 0.317482 -0.199826 -0.283270 -0.143834 -0.114615 -0.187258 0.095743 0.046831 0.095653 0.093484 0.089271 0.098703 0.089255 0.098370 0.138091 0.139613 0.141845 0.147999 0.147497 0.145329 0.146056 0.158628 0.147514 0.128045 0.153650 0.150342 0.159033 0.156543 0.157372
qa: -0.2128 -0.2132 -0.2826 -0.4142 -0.3404 -0.3288 -0.0855 0.1405 0.0608 -0.0245 -0.2927 -0.3118 0.3124 -0.1707 -0.1712 0.4227 -0.1807 -0.2022 0.2694 0.0609 -0.2486 -0.1914 0.2644 -0.2378 -0.1058 -0.2477 0.4179 0.3175 -0.1998 -0.2833 -0.1438 -0.1146 -0.1873 0.0957 0.0468 0.0957 0.0935 0.0893 0.0987 0.0893 0.0984 0.1381 0.1396 0.1418 0.1480 0.1475 0.1453 0.1461 0.1586 0.1475 0.1280 0.1537 0.1503 0.1590 0.1565 0.1574
va: 1.0639 1.0660 2.1476 2.0832 2.0178 2.0476 3.1111 3.6702 3.8114 3.4851 3.9251 3.9517 4.2883 3.9141 3.9183 3.7376 3.9846 4.0728 3.5774 3.5666 3.9452 3.9616 3.6525 4.0879 3.8982 4.0357 4.2545 3.6719 3.9120 3.9624 3.8921 3.8945 3.9179 1.0391 1.0265 1.0128 1.0045 1.0021 1.0046 1.0023 1.0005 1.0048 1.0189 1.0159 1.0018 1.0064 1.0137 1.0044 0.9887 1.0055 0.9748 0.9984 1.0162 0.9903 0.9908 0.9904
dispcorr: -0.035548299 hartree
energy: -1560.154825584636
dipole: 19.25262 -19.57876 -0.32613 -4.91717 4.29361 -0.62356 9.01915 -9.54124 -0.52209
magnitude: 0.87622 au
magnitude: 2.22718 debye
