program: Orca
programVersion: 5.0.2
elementType: F F O O O O N C C C C C C C C C C C C C C C C C C C C C C C C C C H H H H H H H H H H H H H H H H H H H H H H H
charge: 0
multiplicity: 1
keywords: wb97x-d3
keywords: def2-TZVPP
keywords: def2/J RIJCOSX
keywords: DEFGRID2
keywords: scfconv7
keywords: smallprint printgap noloewdin
keywords: NOSOSCF
formula: C26H23F2NO4
InChI: InChI=1/C26H23F2NO4/c1-17(2)24(18-11-13-21(14-12-18)32-26(27)28)25(30)33-23(16-29)19-7-6-10-22(15-19)31-20-8-4-3-5-9-20/h3-15,17,23-24,26H,1-2H3
56 atoms
F  -3.46645 -2.95439 0.579425
F  -3.298186 -0.915793 1.295606
O  3.436428 0.361157 0.297403
O  2.785348 0.225724 -1.836255
O  -1.927424 -2.47545 2.133839
O  -1.397298 3.08442 -1.04513
N  4.381191 2.80929 2.311202
C  3.043423 -1.800254 -0.537185
C  3.26374 -2.653329 -1.793869
C  1.696209 -2.002649 0.133044
C  4.665847 -2.434031 -2.35301
C  3.052045 -4.128657 -1.474981
C  3.096025 -0.316751 -0.810388
C  0.510116 -1.736751 -0.54236
C  1.615766 -2.416625 1.457609
C  3.041346 1.730262 0.347353
C  -0.727337 -1.879806 0.069044
C  0.390927 -2.565025 2.085607
C  -0.781664 -2.293991 1.393827
C  1.557419 1.82186 0.610853
C  0.726935 2.408191 -0.330999
C  1.025381 1.244506 1.759457
C  -0.643979 2.443939 -0.10697
C  3.806466 2.319438 1.446751
C  -0.34279 1.284663 1.966714
C  -1.185671 1.888237 1.044094
C  -3.170061 -2.210827 1.671338
C  -2.667737 2.655635 -1.324483
C  -3.633492 3.63091 -1.525655
C  -2.978818 1.30813 -1.461493
C  -4.923233 3.251889 -1.869772
C  -4.276381 0.94354 -1.789188
C  -5.252779 1.909563 -1.994901
H  3.822025 -2.047827 0.191151
H  2.53323 -2.357794 -2.553126
H  4.822901 -3.042684 -3.244819
H  5.426666 -2.720364 -1.622876
H  4.850944 -1.397251 -2.636357
H  2.032582 -4.341118 -1.151435
H  3.246867 -4.740589 -2.357123
H  3.728526 -4.465699 -0.685619
H  0.529799 -1.406105 -1.573572
H  2.520742 -2.627459 2.014142
H  3.31124 2.264021 -0.569005
H  -1.608895 -1.660763 -0.514542
H  0.343649 -2.887731 3.118133
H  1.136467 2.84209 -1.235184
H  1.667619 0.772006 2.492516
H  -0.764116 0.848034 2.862435
H  -2.250464 1.926736 1.233411
H  -3.883128 -2.430658 2.46389
H  -3.374525 4.677082 -1.419679
H  -2.221082 0.547084 -1.321273
H  -5.67455 4.01394 -2.032213
H  -4.52065 -0.106228 -1.889843
H  -6.261848 1.618019 -2.254808
elementType: F O N C H
totalener: -1560.11731754 hartree
nucrepener: 3458.20539362 hartree
electener: -5018.32271116 hartree
oneelecener: -9007.99868458 hartree
twoeener: 3989.67597342 hartree
cpcmener: -0.03545991 hartree
kineticenergy: 1553.64177327 hartree
xcener: -146.818496244895 hartree
chargesum: 0.0000000
charge: -0.216521 -0.211137 -0.276962 -0.416293 -0.305913 -0.327189 -0.084783 0.134798 0.062128 -0.036158 -0.291546 -0.311712 0.316753 -0.218756 -0.159080 0.409051 -0.193778 -0.186590 0.284216 0.057732 -0.231933 -0.262265 0.299531 -0.235622 -0.125451 -0.198043 0.432013 0.277852 -0.233649 -0.183221 -0.130779 -0.169973 -0.168994 0.096159 0.045131 0.092873 0.088493 0.094885 0.098076 0.097654 0.089577 0.139489 0.136355 0.136805 0.140330 0.140433 0.133563 0.147330 0.156371 0.152589 0.138249 0.145180 0.163762 0.157447 0.154478 0.157044
qa: -0.2165 -0.2111 -0.2770 -0.4163 -0.3059 -0.3272 -0.0848 0.1348 0.0621 -0.0362 -0.2915 -0.3117 0.3168 -0.2188 -0.1591 0.4091 -0.1938 -0.1866 0.2842 0.0577 -0.2319 -0.2623 0.2995 -0.2356 -0.1255 -0.1980 0.4320 0.2779 -0.2336 -0.1832 -0.1308 -0.1700 -0.1690 0.0962 0.0451 0.0929 0.0885 0.0949 0.0981 0.0977 0.0896 0.1395 0.1364 0.1368 0.1403 0.1404 0.1336 0.1473 0.1564 0.1526 0.1382 0.1452 0.1638 0.1574 0.1545 0.1570
va: 1.0653 1.0747 2.1495 2.0815 2.1285 2.0858 3.1125 3.6695 3.8078 3.4986 3.9247 3.9511 4.2907 3.9669 3.9499 3.7381 3.9132 3.9830 3.6813 3.5620 4.0741 3.9706 3.7374 4.0860 3.8611 3.8938 4.2253 3.7062 3.9956 3.8757 3.8903 3.9169 3.8965 1.0388 1.0266 1.0047 1.0022 1.0129 1.0003 1.0048 1.0019 1.0214 1.0035 1.0181 1.0196 1.0074 1.0230 1.0107 0.9936 1.0032 0.9728 1.0080 0.9869 0.9892 0.9958 0.9901
dispcorr: -0.035742142 hartree
energy: -1560.153059682769
dipole: 15.18440 -16.54802 -1.36363 -11.93669 10.20936 -1.72732 -13.66813 13.69358 0.02545
magnitude: 2.20086 au
magnitude: 5.59413 debye
