program: Orca
programVersion: 5.0.2
elementType: F F O O O O N C C C C C C C C C C C C C C C C C C C C C C C C C C H H H H H H H H H H H H H H H H H H H H H H H
charge: 0
multiplicity: 1
keywords: wb97x-d3
keywords: def2-TZVPP
keywords: def2/J RIJCOSX
keywords: DEFGRID2
keywords: scfconv7
keywords: smallprint printgap noloewdin
keywords: NOSOSCF
formula: C26H23F2NO4
InChI: InChI=1/C26H23F2NO4/c1-17(2)24(18-11-13-21(14-12-18)32-26(27)28)25(30)33-23(16-29)19-7-6-10-22(15-19)31-20-8-4-3-5-9-20/h3-15,17,23-24,26H,1-2H3
56 atoms
F  -3.106592 -2.062243 2.775449
F  -3.037658 -3.961163 3.811318
O  2.771553 0.510299 0.074827
O  1.730002 0.464868 -1.902093
O  -1.213372 -3.218201 2.948402
O  -2.483092 2.858213 -0.450955
N  3.681022 2.779482 2.294469
C  2.576463 -1.595956 -0.94415
C  2.55522 -2.29345 -2.309817
C  1.5378 -2.097025 0.041822
C  3.693747 -1.791547 -3.192312
C  2.663445 -3.803369 -2.13108
C  2.323109 -0.108652 -1.029172
C  1.922777 -2.554169 1.297971
C  0.18004 -2.041447 -0.250223
C  2.255136 1.814862 0.330583
C  0.98389 -2.940192 2.237505
C  -0.778382 -2.413188 0.683436
C  -0.368061 -2.857326 1.933001
C  0.798823 1.736975 0.724041
C  -0.148387 2.383391 -0.055235
C  0.417045 0.961786 1.813125
C  -1.495948 2.232194 0.248214
C  3.069279 2.341964 1.426723
C  -0.929847 0.830715 2.11013
C  -1.890357 1.452106 1.326749
C  -2.552755 -3.29966 2.750026
C  -2.334652 3.130944 -1.785178
C  -1.832909 2.194442 -2.681579
C  -2.769726 4.372417 -2.225092
C  -1.761299 2.520488 -4.028141
C  -2.704377 4.679086 -3.576767
C  -2.195703 3.758715 -4.482542
H  3.56389 -1.747449 -0.495239
H  1.604728 -2.073799 -2.805635
H  3.670909 -2.28511 -4.165074
H  4.663519 -2.008592 -2.737726
H  3.646522 -0.717996 -3.376772
H  2.692832 -4.3001 -3.102166
H  3.576954 -4.074911 -1.595916
H  1.81976 -4.218936 -1.579607
H  2.974117 -2.607286 1.552814
H  -0.158799 -1.681441 -1.214341
H  2.390899 2.474577 -0.532095
H  1.296784 -3.29296 3.212189
H  -1.822039 -2.315507 0.416636
H  0.170383 2.990382 -0.893511
H  1.156337 0.456509 2.422659
H  -1.239162 0.224371 2.950831
H  -2.943283 1.33756 1.551734
H  -2.852905 -3.806474 1.82971
H  -1.49877 1.221418 -2.342473
H  -3.160618 5.089487 -1.513844
H  -1.36717 1.793859 -4.727049
H  -3.04728 5.64714 -3.918587
H  -2.139236 4.0031 -5.535083
elementType: F O N C H
totalener: -1560.11861516 hartree
nucrepener: 3398.11597872 hartree
electener: -4958.23459388 hartree
oneelecener: -8887.23840385 hartree
twoeener: 3929.00380997 hartree
cpcmener: -0.03684691 hartree
kineticenergy: 1553.64377146 hartree
xcener: -146.819111353709 hartree
chargesum: -0.0000000
charge: -0.207534 -0.199810 -0.272213 -0.418941 -0.279959 -0.325654 -0.085806 0.125333 0.067947 -0.053230 -0.293252 -0.311639 0.317713 -0.142413 -0.190496 0.392371 -0.220994 -0.191568 0.294755 0.076300 -0.211699 -0.297894 0.310135 -0.230490 -0.113286 -0.228352 0.395607 0.285117 -0.192190 -0.244912 -0.145560 -0.122286 -0.180602 0.097929 0.043148 0.093286 0.088348 0.093856 0.097563 0.089808 0.098288 0.137129 0.143962 0.138657 0.143255 0.135830 0.144935 0.148783 0.154665 0.146153 0.125577 0.155433 0.145505 0.158294 0.157408 0.157692
qa: -0.2075 -0.1998 -0.2722 -0.4189 -0.2800 -0.3257 -0.0858 0.1253 0.0679 -0.0532 -0.2933 -0.3116 0.3177 -0.1424 -0.1905 0.3924 -0.2210 -0.1916 0.2948 0.0763 -0.2117 -0.2979 0.3101 -0.2305 -0.1133 -0.2284 0.3956 0.2851 -0.1922 -0.2449 -0.1456 -0.1223 -0.1806 0.0979 0.0431 0.0933 0.0883 0.0939 0.0976 0.0898 0.0983 0.1371 0.1440 0.1387 0.1433 0.1358 0.1449 0.1488 0.1547 0.1462 0.1256 0.1554 0.1455 0.1583 0.1574 0.1577
va: 1.0557 1.0785 2.1488 2.0761 2.0738 2.0890 3.1115 3.6791 3.8090 3.5067 3.9276 3.9498 4.2755 3.9690 3.9351 3.7584 4.0083 3.8890 3.7175 3.5314 3.9446 3.9855 3.7266 4.0801 3.8559 4.0117 4.2502 3.6889 3.9118 4.0122 3.8959 3.8822 3.9056 1.0365 1.0274 1.0045 1.0018 1.0147 1.0045 1.0021 1.0006 1.0031 1.0121 1.0165 1.0068 1.0163 1.0083 1.0072 1.0021 1.0069 0.9748 0.9989 1.0083 0.9911 0.9892 0.9905
dispcorr: -0.034128253 hartree
energy: -1560.152743413806
dipole: 17.94512 -18.17334 -0.22822 -3.84241 2.36442 -1.47799 -31.02743 28.95939 -2.06803
magnitude: 2.55212 au
magnitude: 6.48696 debye
