program: Orca
programVersion: 5.0.2
elementType: F F O O O O N C C C C C C C C C C C C C C C C C C C C C C C C C C H H H H H H H H H H H H H H H H H H H H H H H
charge: 0
multiplicity: 1
keywords: wb97x-d3
keywords: def2-TZVPP
keywords: def2/J RIJCOSX
keywords: DEFGRID2
keywords: scfconv7
keywords: smallprint printgap noloewdin
keywords: NOSOSCF
formula: C26H23F2NO4
InChI: InChI=1/C26H23F2NO4/c1-17(2)24(18-11-13-21(14-12-18)32-26(27)28)25(30)33-23(16-29)19-7-6-10-22(15-19)31-20-8-4-3-5-9-20/h3-15,17,23-24,26H,1-2H3
56 atoms
F  -3.528055 -4.026309 1.659236
F  -4.788196 -2.33921 1.18539
O  2.550322 0.404167 0.832022
O  3.955471 0.150871 -0.881687
O  -2.845051 -2.448649 0.243128
O  -1.321951 2.777843 -1.650795
N  2.061139 2.638038 3.204761
C  2.786937 -1.782637 0.019056
C  3.466468 -2.67316 -1.041226
C  1.287114 -1.942644 0.105259
C  3.347143 -4.140229 -0.643774
C  2.95917 -2.473054 -2.464645
C  3.173142 -0.326234 -0.106154
C  0.718396 -2.699346 1.120432
C  0.433728 -1.366241 -0.835434
C  2.811428 1.799234 0.846146
C  -0.654515 -2.895708 1.206447
C  -0.936044 -1.542452 -0.762538
C  -1.480119 -2.306704 0.261032
C  2.048674 2.546741 -0.222209
C  0.69969 2.268481 -0.416703
C  2.691769 3.520395 -0.968744
C  -0.010738 2.995738 -1.360933
C  2.388679 2.251018 2.174366
C  1.969295 4.233654 -1.915984
C  0.623304 3.981468 -2.111643
C  -3.510758 -2.69537 1.399984
C  -2.183695 2.206215 -0.753422
C  -3.106385 1.304836 -1.266938
C  -2.202673 2.549656 0.592865
C  -4.046219 0.731072 -0.423307
C  -3.139792 1.957324 1.427384
C  -4.061195 1.0459 0.928745
H  3.199494 -2.085798 0.990583
H  4.529643 -2.415076 -1.020965
H  2.30985 -4.480961 -0.65589
H  3.747379 -4.324828 0.355121
H  3.903735 -4.768878 -1.340732
H  1.935914 -2.83254 -2.585729
H  2.990174 -1.431931 -2.785985
H  3.58082 -3.041822 -3.158399
H  1.353511 -3.158764 1.868041
H  0.831338 -0.757749 -1.638847
H  3.883478 2.004955 0.758405
H  -1.040845 -3.515824 2.004236
H  -1.583206 -1.086836 -1.500407
H  0.215754 1.496317 0.168579
H  3.743388 3.724189 -0.812719
H  2.459044 4.996341 -2.506832
H  0.059635 4.540263 -2.84834
H  -3.115783 -2.166031 2.270471
H  -3.088631 1.057551 -2.32135
H  -1.501359 3.269296 0.996795
H  -4.764909 0.030847 -0.829461
H  -3.149861 2.220286 2.477355
H  -4.790405 0.593722 1.587784
elementType: F O N C H
totalener: -1560.11787892 hartree
nucrepener: 3446.71229341 hartree
electener: -5006.83017233 hartree
oneelecener: -8984.46189750 hartree
twoeener: 3977.63172517 hartree
cpcmener: -0.03683917 hartree
kineticenergy: 1553.63696011 hartree
xcener: -146.819526997856 hartree
chargesum: 0.0000000
charge: -0.210774 -0.201117 -0.281886 -0.416506 -0.280060 -0.321508 -0.087683 0.112645 0.082606 0.069412 -0.326163 -0.320998 0.346168 -0.220280 -0.298264 0.387784 -0.140416 -0.188195 0.230283 0.058425 -0.302725 -0.216487 0.344065 -0.227106 -0.097004 -0.257203 0.387274 0.336482 -0.282845 -0.224481 -0.131079 -0.129107 -0.178594 0.101311 0.046112 0.088824 0.097763 0.101812 0.085939 0.097077 0.104853 0.143243 0.156596 0.144596 0.143547 0.166290 0.148385 0.143868 0.158924 0.147178 0.130311 0.149082 0.157294 0.155966 0.159504 0.156862
qa: -0.2108 -0.2011 -0.2819 -0.4165 -0.2801 -0.3215 -0.0877 0.1126 0.0826 0.0694 -0.3262 -0.3210 0.3462 -0.2203 -0.2983 0.3878 -0.1404 -0.1882 0.2303 0.0584 -0.3027 -0.2165 0.3441 -0.2271 -0.0970 -0.2572 0.3873 0.3365 -0.2828 -0.2245 -0.1311 -0.1291 -0.1786 0.1013 0.0461 0.0888 0.0978 0.1018 0.0859 0.0971 0.1049 0.1432 0.1566 0.1446 0.1435 0.1663 0.1484 0.1439 0.1589 0.1472 0.1303 0.1491 0.1573 0.1560 0.1595 0.1569
va: 1.0553 1.0711 2.1290 2.0875 2.0486 2.0997 3.1098 3.7696 3.8369 3.4600 3.9448 3.9345 4.2502 4.0248 3.9434 3.7478 3.8922 3.9612 3.8485 3.5920 3.9677 3.9903 3.6854 4.0812 3.8848 4.0116 4.2335 3.6021 3.9713 3.9180 3.8217 3.8911 3.8509 1.0261 1.0247 0.9992 1.0020 1.0045 0.9975 1.0150 1.0053 1.0025 0.9911 1.0164 1.0145 0.9928 1.0032 1.0035 0.9890 1.0068 0.9782 1.0071 0.9972 0.9978 0.9896 0.9965
dispcorr: -0.035216829 hartree
energy: -1560.153095749074
dipole: 22.61665 -21.57305 1.04360 -5.30789 4.93180 -0.37609 -12.62224 12.29038 -0.33186
magnitude: 1.15787 au
magnitude: 2.94308 debye
