program: Orca
programVersion: 5.0.2
elementType: F F O O O O N C C C C C C C C C C C C C C C C C C C C C C C C C C H H H H H H H H H H H H H H H H H H H H H H H
charge: 0
multiplicity: 1
keywords: wb97x-d3
keywords: def2-TZVPP
keywords: def2/J RIJCOSX
keywords: DEFGRID2
keywords: scfconv7
keywords: smallprint printgap noloewdin
keywords: NOSOSCF
formula: C26H23F2NO4
InChI: InChI=1/C26H23F2NO4/c1-17(2)24(18-11-13-21(14-12-18)32-26(27)28)25(30)33-23(16-29)19-7-6-10-22(15-19)31-20-8-4-3-5-9-20/h3-15,17,23-24,26H,1-2H3
56 atoms
F  -3.273309 -3.738666 0.362558
F  -3.802124 -2.387903 -1.231749
O  3.298061 0.409235 0.727893
O  3.265355 -0.13902 -1.436851
O  -2.941251 -1.552578 0.663429
O  -1.367559 2.210551 0.982227
N  4.364965 2.976742 2.504412
C  2.718691 -1.812019 0.227103
C  3.240522 -2.966405 -0.6418
C  1.205902 -1.757571 0.323812
C  4.76539 -2.986408 -0.6557
C  2.703468 -4.294435 -0.121389
C  3.142929 -0.45711 -0.28512
C  0.571062 -1.875764 1.554097
C  0.423492 -1.573261 -0.813099
C  3.427928 1.77937 0.380084
C  -0.812361 -1.833708 1.648858
C  -0.958698 -1.518158 -0.732089
C  -1.571145 -1.653884 0.505385
C  2.103833 2.393842 -0.017378
C  0.936083 1.999298 0.624122
C  2.067874 3.365692 -1.005886
C  -0.266286 2.591379 0.272453
C  3.951804 2.433744 1.580704
C  0.857771 3.95983 -1.336408
C  -0.314243 3.583144 -0.700489
C  -3.744286 -2.49564 0.119133
C  -2.539775 1.87192 0.36917
C  -2.629184 1.465828 -0.956146
C  -3.670737 1.895379 1.176966
C  -3.863669 1.082264 -1.4632
C  -4.893782 1.503115 0.657268
C  -4.999142 1.096032 -0.666125
H  3.117733 -1.937103 1.238334
H  2.881739 -2.826147 -1.666087
H  5.197041 -2.073428 -1.067738
H  5.132099 -3.815222 -1.26293
H  5.164173 -3.117689 0.35296
H  2.999693 -4.460905 0.917342
H  1.615572 -4.350261 -0.16934
H  3.097535 -5.122573 -0.712446
H  1.158992 -2.013424 2.453057
H  0.886655 -1.465861 -1.785837
H  4.164303 1.922438 -0.417534
H  -1.298271 -1.931861 2.610989
H  -1.535301 -1.349156 -1.629846
H  0.944861 1.2442 1.401043
H  2.977414 3.662344 -1.512685
H  0.825813 4.726833 -2.098824
H  -1.251087 4.060195 -0.959303
H  -4.745462 -2.384256 0.529493
H  -1.75554 1.428825 -1.593279
H  -3.586607 2.211214 2.209285
H  -3.929752 0.763772 -2.495385
H  -5.769643 1.521697 1.293091
H  -5.955657 0.793845 -1.071368
elementType: F O N C H
totalener: -1560.11868779 hartree
nucrepener: 3482.55616413 hartree
electener: -5042.67485192 hartree
oneelecener: -9057.21026838 hartree
twoeener: 4014.53541646 hartree
cpcmener: -0.03669110 hartree
kineticenergy: 1553.66456182 hartree
xcener: -146.821893654845 hartree
chargesum: 0.0000000
charge: -0.213113 -0.216850 -0.277524 -0.418107 -0.331845 -0.322689 -0.085193 0.149333 0.060387 -0.050022 -0.291563 -0.314661 0.318659 -0.175424 -0.159838 0.386261 -0.160392 -0.194421 0.235156 0.054091 -0.255559 -0.197462 0.259103 -0.231053 -0.118214 -0.196864 0.431937 0.346663 -0.205831 -0.271660 -0.176288 -0.110067 -0.196505 0.093776 0.049307 0.094401 0.093358 0.090017 0.090151 0.098506 0.098822 0.136828 0.139655 0.145247 0.146485 0.150874 0.144866 0.145432 0.160692 0.160219 0.128375 0.152125 0.142510 0.155877 0.155838 0.156192
qa: -0.2131 -0.2168 -0.2775 -0.4181 -0.3318 -0.3227 -0.0852 0.1493 0.0604 -0.0500 -0.2916 -0.3147 0.3187 -0.1754 -0.1598 0.3863 -0.1604 -0.1944 0.2352 0.0541 -0.2556 -0.1975 0.2591 -0.2311 -0.1182 -0.1969 0.4319 0.3467 -0.2058 -0.2717 -0.1763 -0.1101 -0.1965 0.0938 0.0493 0.0944 0.0934 0.0900 0.0902 0.0985 0.0988 0.1368 0.1397 0.1452 0.1465 0.1509 0.1449 0.1454 0.1607 0.1602 0.1284 0.1521 0.1425 0.1559 0.1558 0.1562
va: 1.0682 1.0551 2.1403 2.0785 2.0306 2.0620 3.1134 3.6718 3.8080 3.4730 3.9241 3.9513 4.2422 3.9364 3.9568 3.7354 4.0436 4.0239 3.6294 3.6114 4.0484 3.9893 3.7545 4.0810 3.8800 3.9451 4.2335 3.5655 3.8254 4.0077 3.8930 3.8747 3.8831 1.0400 1.0254 1.0127 1.0045 1.0021 1.0020 1.0004 1.0046 1.0045 1.0211 1.0166 1.0027 1.0061 1.0169 1.0018 0.9898 0.9939 0.9783 0.9992 1.0109 0.9929 0.9893 0.9908
dispcorr: -0.036332910 hartree
energy: -1560.155020699716
dipole: 16.50872 -17.36236 -0.85364 -7.69593 7.01962 -0.67631 -5.52174 4.57875 -0.94300
magnitude: 1.44060 au
magnitude: 3.66173 debye
