program: Orca
programVersion: 5.0.2
elementType: F F O O O O N C C C C C C C C C C C C C C C C C C C C C C C C C C H H H H H H H H H H H H H H H H H H H H H H H
charge: 0
multiplicity: 1
keywords: wb97x-d3
keywords: def2-TZVPP
keywords: def2/J RIJCOSX
keywords: DEFGRID2
keywords: scfconv7
keywords: smallprint printgap noloewdin
keywords: NOSOSCF
formula: C26H23F2NO4
InChI: InChI=1/C26H23F2NO4/c1-17(2)24(18-11-13-21(14-12-18)32-26(27)28)25(30)33-23(16-29)19-7-6-10-22(15-19)31-20-8-4-3-5-9-20/h3-15,17,23-24,26H,1-2H3
56 atoms
F  -3.521583 -1.234488 1.705781
F  -3.753129 -2.823187 3.152301
O  3.094622 0.543244 -0.046513
O  2.035261 0.412073 -2.011437
O  -1.753477 -2.317162 2.52602
O  -2.272674 2.443107 0.08343
N  4.393109 3.066936 1.649841
C  2.717172 -1.620337 -0.888918
C  2.800068 -2.405548 -2.204094
C  1.508149 -1.933636 -0.025316
C  4.066258 -2.03404 -2.969334
C  2.773054 -3.904253 -1.92904
C  2.596652 -0.127612 -1.096496
C  1.653106 -2.238517 1.324158
C  0.220723 -1.806759 -0.534559
C  2.616537 1.875519 0.153572
C  0.549154 -2.395679 2.144628
C  -0.897146 -1.940856 0.275287
C  -0.725904 -2.224374 1.623791
C  1.262675 1.816844 0.819105
C  0.135341 2.21407 0.113919
C  1.147352 1.272134 2.094016
C  -1.119172 2.042458 0.689366
C  3.616329 2.528181 0.997941
C  -0.107257 1.126442 2.660667
C  -1.244306 1.496196 1.958687
C  -3.033267 -2.44055 2.088797
C  -2.469945 2.309763 -1.262513
C  -3.31193 3.244377 -1.852222
C  -1.929256 1.27223 -2.013809
C  -3.612963 3.139597 -3.201694
C  -2.230731 1.188198 -3.366488
C  -3.070801 2.115423 -3.967301
H  3.619031 -1.822682 -0.303139
H  1.9333 -2.15375 -2.822726
H  4.959084 -2.268192 -2.384551
H  4.106876 -0.975318 -3.22825
H  4.130344 -2.594744 -3.902882
H  1.849766 -4.220334 -1.442339
H  2.85656 -4.463775 -2.86207
H  3.606812 -4.20519 -1.289798
H  2.643461 -2.344221 1.749554
H  0.066451 -1.570024 -1.580103
H  2.570893 2.431804 -0.787275
H  0.677034 -2.62282 3.195498
H  -1.872403 -1.78978 -0.166839
H  0.240267 2.647993 -0.872842
H  2.02655 0.959074 2.643799
H  -0.206028 0.703618 3.651648
H  -2.226302 1.374881 2.397615
H  -3.166015 -3.153873 1.271964
H  -3.733299 4.042591 -1.2526
H  -1.280785 0.531981 -1.562419
H  -4.27313 3.868177 -3.654836
H  -1.804637 0.382088 -3.950858
H  -3.301993 2.039794 -5.021799
elementType: F O N C H
totalener: -1560.11743020 hartree
nucrepener: 3481.67752487 hartree
electener: -5041.79495507 hartree
oneelecener: -9054.32502839 hartree
twoeener: 4012.53007332 hartree
cpcmener: -0.03696576 hartree
kineticenergy: 1553.63191174 hartree
xcener: -146.817770293568 hartree
chargesum: 0.0000000
charge: -0.207415 -0.198560 -0.273898 -0.420570 -0.283184 -0.323859 -0.085742 0.139085 0.056163 -0.025753 -0.294531 -0.308541 0.312998 -0.152617 -0.227202 0.402695 -0.217234 -0.162205 0.269439 0.063427 -0.221530 -0.271676 0.323891 -0.232041 -0.086020 -0.256054 0.391020 0.291887 -0.236889 -0.154065 -0.133428 -0.189732 -0.167110 0.097069 0.046270 0.089447 0.095783 0.093507 0.098438 0.097205 0.089390 0.136680 0.152374 0.134425 0.142510 0.137669 0.146662 0.145736 0.157890 0.140974 0.129185 0.145325 0.131347 0.157845 0.156093 0.157432
qa: -0.2074 -0.1986 -0.2739 -0.4206 -0.2832 -0.3239 -0.0857 0.1391 0.0562 -0.0258 -0.2945 -0.3085 0.3130 -0.1526 -0.2272 0.4027 -0.2172 -0.1622 0.2694 0.0634 -0.2215 -0.2717 0.3239 -0.2320 -0.0860 -0.2561 0.3910 0.2919 -0.2369 -0.1541 -0.1334 -0.1897 -0.1671 0.0971 0.0463 0.0894 0.0958 0.0935 0.0984 0.0972 0.0894 0.1367 0.1524 0.1344 0.1425 0.1377 0.1467 0.1457 0.1579 0.1410 0.1292 0.1453 0.1313 0.1578 0.1561 0.1574
va: 1.0524 1.0810 2.1514 2.0731 2.0518 2.0961 3.1123 3.6663 3.8149 3.5066 3.9250 3.9449 4.2778 3.9621 3.9863 3.7471 3.9660 3.8649 3.7377 3.5483 3.9349 3.9594 3.6771 4.0777 3.8264 3.9669 4.2438 3.6889 3.9804 3.8593 3.8989 3.9497 3.8930 1.0373 1.0271 1.0023 1.0121 1.0044 1.0009 1.0044 1.0023 1.0040 1.0053 1.0204 1.0067 1.0178 1.0083 1.0098 0.9910 1.0185 0.9758 1.0089 0.9863 0.9892 0.9927 0.9904
dispcorr: -0.036311839 hartree
energy: -1560.153742036390
dipole: 19.30801 -19.67949 -0.37149 -10.41361 8.44236 -1.97125 -25.34818 23.99409 -1.35409
magnitude: 2.42021 au
magnitude: 6.15167 debye
