program: Orca
programVersion: 5.0.2
elementType: F F O O O O N C C C C C C C C C C C C C C C C C C C C C C C C C C H H H H H H H H H H H H H H H H H H H H H H H
charge: 0
multiplicity: 1
keywords: wb97x-d3
keywords: def2-TZVPP
keywords: def2/J RIJCOSX
keywords: DEFGRID2
keywords: scfconv7
keywords: smallprint printgap noloewdin
keywords: NOSOSCF
formula: C26H23F2NO4
InChI: InChI=1/C26H23F2NO4/c1-17(2)24(18-11-13-21(14-12-18)32-26(27)28)25(30)33-23(16-29)19-7-6-10-22(15-19)31-20-8-4-3-5-9-20/h3-15,17,23-24,26H,1-2H3
56 atoms
F  -3.469476 -1.27536 1.803254
F  -3.69169 -2.883829 3.231124
O  3.091822 0.548115 -0.044911
O  2.021888 0.415389 -2.003727
O  -1.700723 -2.394655 2.56991
O  -2.259329 2.577044 0.048912
N  4.339553 3.037142 1.730047
C  2.721212 -1.615725 -0.88925
C  2.798434 -2.39965 -2.20519
C  1.523573 -1.943474 -0.015236
C  4.046484 -2.009686 -2.990225
C  2.799332 -3.897582 -1.92603
C  2.588025 -0.124057 -1.091534
C  1.68749 -2.269483 1.327234
C  0.229279 -1.818918 -0.507412
C  2.606005 1.876093 0.159364
C  0.594803 -2.448771 2.158006
C  -0.878209 -1.977992 0.312632
C  -0.687494 -2.28027 1.654526
C  1.23977 1.810554 0.798564
C  0.131633 2.266281 0.099957
C  1.094351 1.213123 2.047271
C  -1.132707 2.106944 0.657093
C  3.585763 2.515582 1.037765
C  -0.169982 1.072347 2.592175
C  -1.289494 1.505181 1.896028
C  -2.990182 -2.494027 2.156701
C  -2.469989 2.399358 -1.289261
C  -3.241025 3.365386 -1.923128
C  -2.003613 1.292608 -1.989764
C  -3.548554 3.220509 -3.267253
C  -2.31108 1.168005 -3.337832
C  -3.081903 2.125382 -3.983049
H  3.62953 -1.812806 -0.311465
H  1.918493 -2.163374 -2.811127
H  4.107147 -2.574791 -3.921543
H  4.952164 -2.223636 -2.417457
H  4.064052 -0.951878 -3.256198
H  3.650478 -4.184264 -1.303239
H  1.891211 -4.225787 -1.419041
H  2.871574 -4.458973 -2.858892
H  2.684147 -2.373962 1.738328
H  0.061221 -1.566719 -1.547194
H  2.577873 2.443761 -0.775252
H  0.735977 -2.691581 3.203726
H  -1.860104 -1.831777 -0.116502
H  0.255796 2.738161 -0.867333
H  1.95881 0.856749 2.594056
H  -0.290652 0.606891 3.561452
H  -2.279435 1.391471 2.31859
H  -3.151284 -3.192106 1.331528
H  -3.601522 4.219732 -1.362661
H  -1.410133 0.529466 -1.501098
H  -4.152426 3.974119 -3.756731
H  -1.945297 0.306714 -3.883036
H  -3.31904 2.018215 -5.033298
elementType: F O N C H
totalener: -1560.11773741 hartree
nucrepener: 3475.12632913 hartree
electener: -5035.24406654 hartree
oneelecener: -9041.20333256 hartree
twoeener: 4005.95926602 hartree
cpcmener: -0.03727057 hartree
kineticenergy: 1553.63315824 hartree
xcener: -146.817523091927 hartree
chargesum: 0.0000000
charge: -0.206906 -0.199204 -0.274324 -0.420119 -0.282599 -0.326968 -0.086398 0.135240 0.057131 -0.034787 -0.294516 -0.309269 0.313714 -0.142256 -0.218114 0.402749 -0.221258 -0.171017 0.277513 0.070781 -0.207134 -0.279470 0.306782 -0.230357 -0.080331 -0.256411 0.389849 0.277683 -0.233294 -0.144697 -0.135042 -0.189329 -0.167368 0.096986 0.046331 0.093469 0.089554 0.095787 0.089358 0.098440 0.097541 0.137072 0.149760 0.134905 0.141973 0.137193 0.146303 0.146495 0.157666 0.141531 0.129812 0.145339 0.133464 0.157467 0.155859 0.157422
qa: -0.2069 -0.1992 -0.2743 -0.4201 -0.2826 -0.3270 -0.0864 0.1352 0.0571 -0.0348 -0.2945 -0.3093 0.3137 -0.1423 -0.2181 0.4027 -0.2213 -0.1710 0.2775 0.0708 -0.2071 -0.2795 0.3068 -0.2304 -0.0803 -0.2564 0.3898 0.2777 -0.2333 -0.1447 -0.1350 -0.1893 -0.1674 0.0970 0.0463 0.0935 0.0896 0.0958 0.0894 0.0984 0.0975 0.1371 0.1498 0.1349 0.1420 0.1372 0.1463 0.1465 0.1577 0.1415 0.1298 0.1453 0.1335 0.1575 0.1559 0.1574
va: 1.0530 1.0801 2.1510 2.0736 2.0551 2.0894 3.1116 3.6683 3.8155 3.5081 3.9245 3.9456 4.2839 3.9487 3.9821 3.7463 3.9708 3.8719 3.7325 3.5310 3.9509 3.9637 3.6908 4.0794 3.8243 3.9781 4.2448 3.7020 3.9777 3.8570 3.9018 3.9445 3.8896 1.0378 1.0264 1.0044 1.0023 1.0123 1.0024 1.0009 1.0044 1.0033 1.0079 1.0201 1.0071 1.0171 1.0089 1.0101 0.9915 1.0174 0.9753 1.0088 0.9896 0.9892 0.9926 0.9903
dispcorr: -0.036176645 hartree
energy: -1560.153914053204
dipole: 19.07685 -19.43571 -0.35885 -10.27535 8.28805 -1.98730 -25.83690 24.43276 -1.40414
magnitude: 2.45962 au
magnitude: 6.25186 debye
