program: Orca
programVersion: 5.0.2
elementType: F F O O O O N C C C C C C C C C C C C C C C C C C C C C C C C C C H H H H H H H H H H H H H H H H H H H H H H H
charge: 0
multiplicity: 1
keywords: wb97x-d3
keywords: def2-TZVPP
keywords: def2/J RIJCOSX
keywords: DEFGRID2
keywords: scfconv7
keywords: smallprint printgap noloewdin
keywords: NOSOSCF
formula: C26H23F2NO4
InChI: InChI=1/C26H23F2NO4/c1-17(2)24(18-11-13-21(14-12-18)32-26(27)28)25(30)33-23(16-29)19-7-6-10-22(15-19)31-20-8-4-3-5-9-20/h3-15,17,23-24,26H,1-2H3
56 atoms
F  -3.239902 -2.520194 3.040742
F  -4.365283 -1.120316 1.8443
O  2.728221 0.421872 -0.962467
O  3.689596 0.069502 1.017799
O  -2.634951 -2.070522 0.947993
O  -2.23035 1.26137 0.341562
N  4.68982 3.080934 -0.025192
C  2.907535 -1.827481 -0.258461
C  3.392308 -2.298891 -1.637761
C  1.424194 -1.976743 0.033224
C  4.878339 -1.995617 -1.805296
C  3.139105 -3.792221 -1.802697
C  3.186976 -0.368742 0.018993
C  0.444275 -1.890655 -0.952429
C  1.013819 -2.102061 1.355641
C  2.505678 1.794183 -0.65844
C  -0.901033 -1.92729 -0.625621
C  -0.328884 -2.141252 1.702553
C  -1.28462 -2.038969 0.70306
C  1.370571 1.94122 0.328623
C  0.109741 1.57592 -0.13132
C  1.54623 2.351096 1.642983
C  -0.977584 1.638537 0.726368
C  3.740687 2.480496 -0.265994
C  0.449715 2.398157 2.492755
C  -0.812354 2.046397 2.043587
C  -3.117691 -1.546846 2.104656
C  -2.701822 1.569135 -0.906174
C  -2.405072 2.769194 -1.542231
C  -3.555305 0.647914 -1.498072
C  -2.956281 3.028693 -2.789054
C  -4.106771 0.927137 -2.739854
C  -3.805007 2.1126 -3.395388
H  3.461122 -2.388474 0.500185
H  2.846492 -1.765545 -2.421285
H  5.471483 -2.488348 -1.031236
H  5.099416 -0.926987 -1.762559
H  5.236035 -2.353317 -2.771813
H  3.483253 -4.131975 -2.78069
H  3.677697 -4.366915 -1.045535
H  2.082571 -4.050243 -1.724041
H  0.716585 -1.784472 -1.994574
H  1.755178 -2.173838 2.142431
H  2.211612 2.234495 -1.614158
H  -1.652279 -1.855466 -1.401855
H  -0.599399 -2.265664 2.743023
H  -0.018192 1.251065 -1.157064
H  2.522053 2.63521 2.014511
H  0.579977 2.715375 3.518894
H  -1.667109 2.093213 2.706729
H  -2.520578 -0.730706 2.517136
H  -1.756385 3.50145 -1.078156
H  -3.79363 -0.27604 -0.98764
H  -2.722406 3.962501 -3.284028
H  -4.772169 0.206349 -3.197335
H  -4.231885 2.324309 -4.366865
elementType: F O N C H
totalener: -1560.11689560 hartree
nucrepener: 3506.46590022 hartree
electener: -5066.58279582 hartree
oneelecener: -9103.61845675 hartree
twoeener: 4037.03566094 hartree
cpcmener: -0.03863986 hartree
kineticenergy: 1553.63654721 hartree
xcener: -146.820962173293 hartree
chargesum: -0.0000000
charge: -0.212041 -0.203830 -0.271694 -0.405889 -0.281528 -0.321708 -0.079918 0.171163 0.045825 0.020887 -0.298146 -0.294464 0.295605 -0.211619 -0.218216 0.417544 -0.202284 -0.155876 0.237765 0.032256 -0.286351 -0.170932 0.288702 -0.242782 -0.119128 -0.243394 0.410254 0.343092 -0.213990 -0.294772 -0.143144 -0.113197 -0.194019 0.101760 0.048094 0.094841 0.092788 0.094230 0.095746 0.090905 0.099741 0.146397 0.139637 0.141740 0.152292 0.145063 0.144950 0.137362 0.159005 0.148694 0.108772 0.153644 0.144493 0.158622 0.159418 0.157636
qa: -0.2120 -0.2038 -0.2717 -0.4059 -0.2815 -0.3217 -0.0799 0.1712 0.0458 0.0209 -0.2981 -0.2945 0.2956 -0.2116 -0.2182 0.4175 -0.2023 -0.1559 0.2378 0.0323 -0.2864 -0.1709 0.2887 -0.2428 -0.1191 -0.2434 0.4103 0.3431 -0.2140 -0.2948 -0.1431 -0.1132 -0.1940 0.1018 0.0481 0.0948 0.0928 0.0942 0.0957 0.0909 0.0997 0.1464 0.1396 0.1417 0.1523 0.1451 0.1450 0.1374 0.1590 0.1487 0.1088 0.1536 0.1445 0.1586 0.1594 0.1576
va: 1.0567 1.0679 2.1224 2.1003 2.0369 2.0335 3.1092 3.6442 3.8401 3.5618 3.9370 3.9334 4.2236 3.9368 4.0334 3.9125 3.9454 3.8751 3.7839 3.6573 3.9758 3.9406 3.5911 4.0467 3.9402 4.0203 4.2423 3.6503 3.9314 3.9644 3.8968 3.9065 3.9233 1.0248 1.0247 1.0035 1.0113 1.0033 1.0050 1.0023 1.0029 1.0036 1.0129 0.9951 0.9998 1.0122 1.0118 1.0173 0.9891 1.0033 0.9839 0.9980 1.0256 0.9903 0.9899 0.9905
dispcorr: -0.037050567 hartree
energy: -1560.153946166297
dipole: 21.57419 -22.37385 -0.79965 -6.53486 6.17909 -0.35577 -20.09521 18.60627 -1.48894
magnitude: 1.72713 au
magnitude: 4.39000 debye
