program: Orca
programVersion: 5.0.2
elementType: F F O O O O N C C C C C C C C C C C C C C C C C C C C C C C C C C H H H H H H H H H H H H H H H H H H H H H H H
charge: 0
multiplicity: 1
keywords: wb97x-d3
keywords: def2-TZVPP
keywords: def2/J RIJCOSX
keywords: DEFGRID2
keywords: scfconv7
keywords: smallprint printgap noloewdin
keywords: NOSOSCF
formula: C26H23F2NO4
InChI: InChI=1/C26H23F2NO4/c1-17(2)24(18-11-13-21(14-12-18)32-26(27)28)25(30)33-23(16-29)19-7-6-10-22(15-19)31-20-8-4-3-5-9-20/h3-15,17,23-24,26H,1-2H3
56 atoms
F  -4.401013 -2.137326 1.67259
F  -3.838329 -2.036006 -0.411592
O  3.2651 0.385976 0.692864
O  3.60949 0.173571 -1.50186
O  -2.38586 -2.695627 1.147308
O  -1.48733 1.991655 0.676173
N  3.85783 2.685065 2.980659
C  3.057879 -1.78231 -0.161949
C  3.5499 -2.727555 -1.279913
C  1.59551 -1.952329 0.189918
C  3.655427 -4.148884 -0.738079
C  2.706002 -2.718188 -2.549437
C  3.346824 -0.327332 -0.443022
C  0.583762 -1.36391 -0.562351
C  1.226966 -2.753424 1.2679
C  3.344533 1.799041 0.576588
C  -0.756137 -1.580165 -0.271578
C  -0.103808 -2.975045 1.577859
C  -1.094444 -2.39231 0.800869
C  2.051095 2.395556 0.071907
C  0.843617 1.926006 0.57228
C  2.074648 3.399841 -0.883922
C  -0.344142 2.468935 0.108252
C  3.635726 2.278178 1.929684
C  0.877549 3.947613 -1.323724
C  -0.335986 3.491684 -0.833979
C  -3.387059 -1.826915 0.850428
C  -2.632725 1.81847 -0.049322
C  -3.826622 1.976273 0.642295
C  -2.633135 1.422463 -1.381551
C  -5.028649 1.725785 -0.002469
C  -3.845197 1.18811 -2.016082
C  -5.045124 1.334504 -1.334181
H  3.634856 -2.026391 0.73665
H  4.561327 -2.399049 -1.53953
H  2.676467 -4.554292 -0.472891
H  4.289427 -4.199787 0.149242
H  4.087225 -4.812755 -1.488703
H  3.188367 -3.329662 -3.314063
H  1.715329 -3.14304 -2.378566
H  2.575245 -1.721458 -2.969009
H  0.821017 -0.728963 -1.407427
H  1.991907 -3.21196 1.882441
H  4.178238 2.102203 -0.065463
H  -1.505538 -1.126128 -0.905443
H  -0.374287 -3.598736 2.420507
H  0.811799 1.144912 1.32256
H  3.017248 3.755547 -1.279959
H  0.887354 4.740614 -2.059801
H  -1.260117 3.934498 -1.183013
H  -3.11905 -0.774065 0.963222
H  -3.809897 2.279321 1.681843
H  -1.706834 1.286901 -1.925593
H  -5.956752 1.844278 0.541829
H  -3.845158 0.880378 -3.05381
H  -5.984616 1.14494 -1.83637
elementType: F O N C H
totalener: -1560.11793075 hartree
nucrepener: 3452.03663872 hartree
electener: -5012.15456947 hartree
oneelecener: -8994.65427454 hartree
twoeener: 3982.49970508 hartree
cpcmener: -0.03628192 hartree
kineticenergy: 1553.64052281 hartree
xcener: -146.819890908000 hartree
chargesum: 0.0000000
charge: -0.202580 -0.207797 -0.274105 -0.412661 -0.284716 -0.324875 -0.086246 0.131646 0.078534 0.048796 -0.327211 -0.315494 0.334430 -0.313656 -0.205210 0.394040 -0.171989 -0.183640 0.247084 0.052843 -0.274260 -0.195692 0.276011 -0.231392 -0.115737 -0.208207 0.410390 0.322125 -0.262695 -0.222149 -0.115683 -0.152333 -0.180972 0.097407 0.049521 0.088913 0.097012 0.101294 0.105728 0.085273 0.097167 0.149399 0.145759 0.142095 0.169915 0.146174 0.140017 0.144537 0.160859 0.156748 0.116809 0.143605 0.163011 0.156508 0.158205 0.157446
qa: -0.2026 -0.2078 -0.2741 -0.4127 -0.2847 -0.3249 -0.0862 0.1316 0.0785 0.0488 -0.3272 -0.3155 0.3344 -0.3137 -0.2052 0.3940 -0.1720 -0.1836 0.2471 0.0528 -0.2743 -0.1957 0.2760 -0.2314 -0.1157 -0.2082 0.4104 0.3221 -0.2627 -0.2221 -0.1157 -0.1523 -0.1810 0.0974 0.0495 0.0889 0.0970 0.1013 0.1057 0.0853 0.0972 0.1494 0.1458 0.1421 0.1699 0.1462 0.1400 0.1445 0.1609 0.1567 0.1168 0.1436 0.1630 0.1565 0.1582 0.1574
va: 1.0759 1.0484 2.1317 2.0843 2.0793 2.0476 3.1128 3.7274 3.8349 3.4600 3.9419 3.9324 4.2503 3.9830 3.9794 3.7443 3.8690 4.0011 3.8505 3.5785 4.0383 3.9895 3.7678 4.0853 3.8849 3.9359 4.2497 3.5418 3.9719 3.8627 3.8604 3.9088 3.9058 1.0356 1.0208 1.0001 1.0020 1.0049 1.0050 0.9973 1.0166 1.0073 0.9980 1.0168 0.9946 1.0052 1.0191 1.0025 0.9899 0.9962 0.9768 1.0097 0.9937 0.9894 0.9908 0.9904
dispcorr: -0.035550917 hartree
energy: -1560.153481662931
dipole: 17.95703 -17.77331 0.18372 -7.81332 7.89464 0.08132 -16.43388 14.85722 -1.57666
magnitude: 1.58941 au
magnitude: 4.03996 debye
