program: Orca
programVersion: 5.0.2
elementType: F F O O O O N C C C C C C C C C C C C C C C C C C C C C C C C C C H H H H H H H H H H H H H H H H H H H H H H H
charge: 0
multiplicity: 1
keywords: wb97x-d3
keywords: def2-TZVPP
keywords: def2/J RIJCOSX
keywords: DEFGRID2
keywords: scfconv7
keywords: smallprint printgap noloewdin
keywords: NOSOSCF
formula: C26H23F2NO4
InChI: InChI=1/C26H23F2NO4/c1-17(2)24(18-11-13-21(14-12-18)32-26(27)28)25(30)33-23(16-29)19-7-6-10-22(15-19)31-20-8-4-3-5-9-20/h3-15,17,23-24,26H,1-2H3
56 atoms
F  -3.3776 -1.384576 -2.311075
F  -4.744502 -2.506537 -1.066002
O  3.122714 0.094389 -0.584724
O  3.207762 0.529282 1.598765
O  -2.890908 -1.848321 -0.184695
O  -1.611942 1.752821 -0.930036
N  5.436719 2.51702 -0.01547
C  2.680897 -1.716786 0.873381
C  3.603808 -2.675406 0.100242
C  1.205342 -1.826384 0.541568
C  5.0593 -2.455452 0.500241
C  3.192417 -4.117621 0.369049
C  3.046328 -0.259258 0.707498
C  0.265156 -1.7195 1.563199
C  0.742109 -1.963645 -0.761288
C  3.200165 1.480492 -0.884014
C  -1.09216 -1.749407 1.297575
C  -0.616095 -1.980108 -1.050187
C  -1.531957 -1.871172 -0.012923
C  1.951259 2.228355 -0.467839
C  0.729036 1.675981 -0.837085
C  1.98614 3.423679 0.233846
C  -0.44803 2.319044 -0.496081
C  4.439431 2.061476 -0.357055
C  0.796702 4.066913 0.552951
C  -0.425763 3.524997 0.194637
C  -3.44235 -2.319797 -1.330887
C  -2.656553 1.55429 -0.071119
C  -3.917727 1.47226 -0.648015
C  -2.491165 1.373835 1.296245
C  -5.017534 1.195055 0.148814
C  -3.604894 1.109418 2.082375
C  -4.868987 1.01578 1.517974
H  2.802132 -1.929538 1.93935
H  3.512316 -2.485974 -0.97299
H  5.417158 -1.451349 0.261776
H  5.709826 -3.156124 -0.025218
H  5.20258 -2.613446 1.571732
H  3.235647 -4.347697 1.436395
H  2.180018 -4.331148 0.024893
H  3.862568 -4.808588 -0.144472
H  0.597422 -1.6127 2.58883
H  1.436664 -2.045662 -1.587577
H  3.289151 1.513214 -1.973294
H  -1.811107 -1.672012 2.103082
H  -0.922175 -2.058456 -2.084467
H  0.677637 0.749077 -1.394798
H  2.925905 3.8673 0.536557
H  0.825531 5.004418 1.092241
H  -1.346327 4.03633 0.446676
H  -2.999253 -3.248945 -1.698743
H  -4.031748 1.61666 -1.714962
H  -1.511418 1.422646 1.753736
H  -5.997957 1.126656 -0.304758
H  -3.474289 0.968834 3.147857
H  -5.729972 0.805809 2.138759
elementType: F O N C H
totalener: -1560.11749953 hartree
nucrepener: 3505.89342164 hartree
electener: -5066.01092117 hartree
oneelecener: -9103.72482419 hartree
twoeener: 4037.71390302 hartree
cpcmener: -0.04066982 hartree
kineticenergy: 1553.64646386 hartree
xcener: -146.824075873712 hartree
chargesum: -0.0000000
charge: -0.215408 -0.204747 -0.272518 -0.407995 -0.291238 -0.326096 -0.077601 0.182928 0.039352 0.017541 -0.296210 -0.298291 0.303938 -0.171184 -0.315361 0.449566 -0.219854 -0.107624 0.254928 -0.011739 -0.307710 -0.178198 0.250358 -0.248410 -0.117726 -0.184786 0.394431 0.353475 -0.296146 -0.208424 -0.117302 -0.158219 -0.180004 0.098592 0.053441 0.092138 0.094476 0.093960 0.091177 0.099806 0.096391 0.139033 0.144923 0.143105 0.146455 0.142128 0.168545 0.133802 0.160404 0.158908 0.151581 0.138966 0.148268 0.155476 0.158171 0.156528
qa: -0.2154 -0.2047 -0.2725 -0.4080 -0.2912 -0.3261 -0.0776 0.1829 0.0394 0.0175 -0.2962 -0.2983 0.3039 -0.1712 -0.3154 0.4496 -0.2199 -0.1076 0.2549 -0.0117 -0.3077 -0.1782 0.2504 -0.2484 -0.1177 -0.1848 0.3944 0.3535 -0.2961 -0.2084 -0.1173 -0.1582 -0.1800 0.0986 0.0534 0.0921 0.0945 0.0940 0.0912 0.0998 0.0964 0.1390 0.1449 0.1431 0.1465 0.1421 0.1685 0.1338 0.1604 0.1589 0.1516 0.1390 0.1483 0.1555 0.1582 0.1565
va: 1.0513 1.0776 2.1198 2.0999 2.0698 2.0509 3.1032 3.6178 3.8310 3.5162 3.9423 3.9301 4.2097 4.0128 4.0121 3.8631 3.9533 3.8714 3.7431 3.7628 4.0406 3.9299 3.8006 4.0847 3.9130 3.9521 4.2173 3.5285 3.9812 3.8492 3.8629 3.8883 3.9075 1.0278 1.0228 1.0096 1.0037 1.0034 1.0024 1.0013 1.0052 1.0058 1.0117 0.9914 1.0056 1.0152 1.0013 1.0166 0.9905 0.9950 0.9733 1.0155 1.0048 0.9890 0.9906 0.9896
dispcorr: -0.037047807 hartree
energy: -1560.154547335334
dipole: 20.64220 -21.40327 -0.76106 -10.17157 8.48431 -1.68726 9.73777 -10.54051 -0.80274
magnitude: 2.01753 au
magnitude: 5.12816 debye
