program: Orca
programVersion: 5.0.2
elementType: F F O O O O N C C C C C C C C C C C C C C C C C C C C C C C C C C H H H H H H H H H H H H H H H H H H H H H H H
charge: 0
multiplicity: 1
keywords: wb97x-d3
keywords: def2-TZVPP
keywords: def2/J RIJCOSX
keywords: DEFGRID2
keywords: scfconv7
keywords: smallprint printgap noloewdin
keywords: NOSOSCF
formula: C26H23F2NO4
InChI: InChI=1/C26H23F2NO4/c1-17(2)24(18-11-13-21(14-12-18)32-26(27)28)25(30)33-23(16-29)19-7-6-10-22(15-19)31-20-8-4-3-5-9-20/h3-15,17,23-24,26H,1-2H3
56 atoms
F  -4.243422 -2.227211 1.753649
F  -3.71013 -2.555181 -0.310156
O  3.208482 0.298158 0.740891
O  3.513249 0.088896 -1.458727
O  -2.21885 -2.849432 1.321566
O  -1.652533 1.329991 -0.111588
N  3.150912 2.688067 3.009853
C  3.192609 -1.895906 -0.093799
C  3.681908 -2.78259 -1.250701
C  1.738921 -2.118356 0.270595
C  5.190193 -2.652408 -1.438841
C  3.320706 -4.242401 -0.99876
C  3.34632 -0.420262 -0.384421
C  1.388981 -2.630279 1.514985
C  0.723389 -1.825646 -0.632791
C  3.126363 1.709193 0.588323
C  0.063555 -2.852329 1.849885
C  -0.609711 -2.049918 -0.318609
C  -0.933521 -2.563368 0.929903
C  1.867722 2.14407 -0.127659
C  0.646905 1.584759 0.225166
C  1.946432 3.094941 -1.134679
C  -0.49832 1.962494 -0.462332
C  3.150863 2.23915 1.952879
C  0.790854 3.474923 -1.799691
C  -0.43303 2.908154 -1.48007
C  -3.24278 -2.079836 0.87144
C  -2.858924 1.940652 -0.347393
C  -3.795713 1.263807 -1.111888
C  -3.150245 3.177139 0.213505
C  -5.046183 1.834151 -1.313052
C  -4.398349 3.74022 -0.00491
C  -5.349024 3.073315 -0.767572
H  3.797402 -2.121724 0.791651
H  3.182504 -2.461185 -2.170084
H  5.723796 -3.000767 -0.551227
H  5.50981 -1.629481 -1.637123
H  5.523701 -3.261568 -2.280499
H  3.740558 -4.599763 -0.055091
H  2.243563 -4.406636 -0.966905
H  3.720783 -4.872984 -1.794297
H  2.161285 -2.861288 2.238539
H  0.960631 -1.42392 -1.610867
H  4.007338 2.100459 0.06874
H  -0.19617 -3.250982 2.82249
H  -1.364181 -1.836439 -1.063526
H  0.573969 0.85257 1.021205
H  2.901599 3.52642 -1.405302
H  0.84226 4.209585 -2.592409
H  -1.318805 3.200921 -2.028649
H  -2.991359 -1.022752 0.759161
H  -3.552787 0.3000 -1.541923
H  -2.413826 3.69356 0.817189
H  -5.781452 1.307356 -1.907351
H  -4.629288 4.704011 0.430116
H  -6.322053 3.5170 -0.932047
elementType: F O N C H
totalener: -1560.11971291 hartree
nucrepener: 3402.59490983 hartree
electener: -4962.71462274 hartree
oneelecener: -8896.13811219 hartree
twoeener: 3933.42348945 hartree
cpcmener: -0.03639225 hartree
kineticenergy: 1553.64251337 hartree
xcener: -146.816641141452 hartree
chargesum: -0.0000000
charge: -0.202120 -0.211349 -0.274219 -0.411008 -0.286354 -0.322225 -0.085810 0.120704 0.071159 -0.070806 -0.293656 -0.314022 0.319253 -0.136801 -0.160614 0.391233 -0.210057 -0.231989 0.285492 0.060943 -0.307201 -0.198898 0.292445 -0.230278 -0.125926 -0.201946 0.428395 0.269410 -0.240518 -0.187369 -0.128741 -0.142378 -0.168763 0.097586 0.043550 0.087248 0.093657 0.093381 0.089766 0.097526 0.098969 0.138444 0.143159 0.144114 0.146358 0.151851 0.140267 0.143479 0.160022 0.155489 0.092300 0.149912 0.160703 0.158607 0.159281 0.158348
qa: -0.2021 -0.2113 -0.2742 -0.4110 -0.2864 -0.3222 -0.0858 0.1207 0.0712 -0.0708 -0.2937 -0.3140 0.3193 -0.1368 -0.1606 0.3912 -0.2101 -0.2320 0.2855 0.0609 -0.3072 -0.1989 0.2924 -0.2303 -0.1259 -0.2019 0.4284 0.2694 -0.2405 -0.1874 -0.1287 -0.1424 -0.1688 0.0976 0.0436 0.0872 0.0937 0.0934 0.0898 0.0975 0.0990 0.1384 0.1432 0.1441 0.1464 0.1519 0.1403 0.1435 0.1600 0.1555 0.0923 0.1499 0.1607 0.1586 0.1593 0.1583
va: 1.0776 1.0484 2.1429 2.0892 2.0694 2.0520 3.1113 3.7181 3.8015 3.5122 3.9305 3.9528 4.2472 3.9623 3.9148 3.7459 4.0361 3.9075 3.7675 3.5619 4.0687 3.9754 3.7391 4.0876 3.9155 3.9303 4.2526 3.6538 3.9849 3.9565 3.8885 3.8962 3.9002 1.0339 1.0272 1.0016 1.0151 1.0045 1.0016 1.0000 1.0048 1.0031 1.0163 1.0122 1.0057 1.0113 1.0146 1.0028 0.9905 0.9988 0.9898 1.0065 0.9949 0.9905 0.9898 0.9900
dispcorr: -0.033682128 hartree
energy: -1560.153395040353
dipole: 22.67566 -22.31848 0.35718 -3.96901 4.37162 0.40261 -14.09223 12.55571 -1.53652
magnitude: 1.62806 au
magnitude: 4.13819 debye
