program: Orca
programVersion: 5.0.2
elementType: F F O O O O N C C C C C C C C C C C C C C C C C C C C C C C C C C H H H H H H H H H H H H H H H H H H H H H H H
charge: 0
multiplicity: 1
keywords: wb97x-d3
keywords: def2-TZVPP
keywords: def2/J RIJCOSX
keywords: DEFGRID2
keywords: scfconv7
keywords: smallprint printgap noloewdin
keywords: NOSOSCF
formula: C26H23F2NO4
InChI: InChI=1/C26H23F2NO4/c1-17(2)24(18-11-13-21(14-12-18)32-26(27)28)25(30)33-23(16-29)19-7-6-10-22(15-19)31-20-8-4-3-5-9-20/h3-15,17,23-24,26H,1-2H3
56 atoms
F  -2.702819 -1.340535 -2.301843
F  -3.21221 -0.996699 -0.23245
O  3.134313 0.402531 0.750185
O  3.886048 -0.362691 -1.214691
O  -2.283281 -2.947597 -0.801238
O  -1.829864 1.596781 1.168131
N  3.405538 3.394958 2.12534
C  3.158631 -1.929477 0.477188
C  4.103567 -3.031609 -0.022037
C  1.698756 -2.160131 0.128535
C  5.531659 -2.7620 0.43944
C  3.639399 -4.394997 0.475417
C  3.473954 -0.572958 -0.106273
C  0.725126 -2.15952 1.120688
C  1.306522 -2.369315 -1.192273
C  2.905132 1.702369 0.201365
C  -0.609674 -2.384039 0.812476
C  -0.021004 -2.601409 -1.513316
C  -0.970807 -2.615964 -0.504127
C  1.478077 1.76696 -0.281053
C  0.440785 1.743565 0.643761
C  1.207045 1.72164 -1.641259
C  -0.870591 1.665885 0.203242
C  3.181164 2.643604 1.28663
C  -0.111396 1.636541 -2.06787
C  -1.154482 1.596394 -1.157322
C  -3.131395 -1.963025 -1.177946
C  -3.054268 2.183211 0.997481
C  -4.136477 1.539114 1.581714
C  -3.222545 3.395778 0.338633
C  -5.398577 2.106653 1.49161
C  -4.49454 3.943477 0.243974
C  -5.58693 3.303841 0.813048
H  3.24158 -1.868157 1.566504
H  4.088334 -3.04108 -1.115961
H  5.919197 -1.807552 0.079549
H  6.205971 -3.538428 0.074739
H  5.597144 -2.757486 1.530244
H  3.59666 -4.425734 1.567241
H  2.652049 -4.661637 0.096822
H  4.331462 -5.173904 0.15187
H  1.007642 -1.992274 2.153234
H  2.039316 -2.365615 -1.989665
H  3.602402 1.924917 -0.6115
H  -1.353902 -2.40644 1.598264
H  -0.304106 -2.795685 -2.53998
H  0.638866 1.779065 1.709472
H  2.014269 1.742009 -2.362153
H  -0.331114 1.58719 -3.12611
H  -2.174216 1.518416 -1.510173
H  -4.115564 -2.392521 -1.351018
H  -3.987709 0.605361 2.110142
H  -2.378898 3.916224 -0.097035
H  -6.239879 1.60101 1.947838
H  -4.62592 4.884335 -0.275802
H  -6.575197 3.737774 0.733505
elementType: F O N C H
totalener: -1560.11779356 hartree
nucrepener: 3459.25543725 hartree
electener: -5019.37323081 hartree
oneelecener: -9010.96411580 hartree
twoeener: 3991.59088500 hartree
cpcmener: -0.03526894 hartree
kineticenergy: 1553.63640167 hartree
xcener: -146.811983469484 hartree
chargesum: -0.0000000
charge: -0.219012 -0.208781 -0.275862 -0.418594 -0.332288 -0.326846 -0.085767 0.147349 0.056673 0.008818 -0.292649 -0.308358 0.318376 -0.188052 -0.220810 0.414952 -0.174953 -0.171287 0.241009 0.054519 -0.282904 -0.191670 0.312824 -0.235962 -0.126338 -0.218008 0.421329 0.322378 -0.269523 -0.214247 -0.111013 -0.142281 -0.191286 0.094431 0.047044 0.095024 0.093642 0.088632 0.089989 0.098134 0.097402 0.137885 0.141908 0.135434 0.147043 0.147745 0.128372 0.143419 0.158683 0.149283 0.144628 0.141052 0.155744 0.156565 0.158880 0.157325
qa: -0.2190 -0.2088 -0.2759 -0.4186 -0.3323 -0.3268 -0.0858 0.1473 0.0567 0.0088 -0.2926 -0.3084 0.3184 -0.1881 -0.2208 0.4150 -0.1750 -0.1713 0.2410 0.0545 -0.2829 -0.1917 0.3128 -0.2360 -0.1263 -0.2180 0.4213 0.3224 -0.2695 -0.2142 -0.1110 -0.1423 -0.1913 0.0944 0.0470 0.0950 0.0936 0.0886 0.0900 0.0981 0.0974 0.1379 0.1419 0.1354 0.1470 0.1477 0.1284 0.1434 0.1587 0.1493 0.1446 0.1411 0.1557 0.1566 0.1589 0.1573
va: 1.0616 1.0745 2.1460 2.0780 2.0794 2.0459 3.1103 3.6495 3.8119 3.4437 3.9291 3.9457 4.2758 3.9380 3.9382 3.7382 3.9559 3.9969 3.7060 3.5874 4.0891 3.9219 3.6339 4.0823 3.8873 3.9048 4.2179 3.6513 3.9999 3.9120 3.8811 3.8865 3.9150 1.0394 1.0272 1.0116 1.0043 1.0025 1.0024 1.0007 1.0046 1.0058 1.0172 1.0191 1.0011 1.0037 1.0294 1.0095 0.9905 1.0113 0.9719 1.0144 0.9985 0.9894 0.9903 0.9907
dispcorr: -0.034614824 hartree
energy: -1560.152408382609
dipole: 17.77872 -18.93154 -1.15282 -12.35075 10.84271 -1.50804 2.69831 -3.75789 -1.05958
magnitude: 2.17391 au
magnitude: 5.52563 debye
