program: Orca
programVersion: 5.0.2
elementType: F F O O O O N C C C C C C C C C C C C C C C C C C C C C C C C C C H H H H H H H H H H H H H H H H H H H H H H H
charge: 0
multiplicity: 1
keywords: wb97x-d3
keywords: def2-TZVPP
keywords: def2/J RIJCOSX
keywords: DEFGRID2
keywords: scfconv7
keywords: smallprint printgap noloewdin
keywords: NOSOSCF
formula: C26H23F2NO4
InChI: InChI=1/C26H23F2NO4/c1-17(2)24(18-11-13-21(14-12-18)32-26(27)28)25(30)33-23(16-29)19-7-6-10-22(15-19)31-20-8-4-3-5-9-20/h3-15,17,23-24,26H,1-2H3
56 atoms
F  -3.694798 -2.927754 0.982918
F  -4.772961 -1.842979 -0.543677
O  3.10011 0.47356 0.457983
O  3.95149 -0.509445 -1.368513
O  -2.641497 -2.043675 -0.771523
O  -1.485074 1.679376 -1.069188
N  5.131772 2.98464 1.224738
C  2.920422 -1.861778 0.35703
C  3.686011 -3.107957 -0.112364
C  1.428993 -1.900043 0.079169
C  5.149088 -3.033996 0.315235
C  3.046082 -4.371823 0.448992
C  3.418479 -0.593496 -0.29667
C  0.512204 -1.753708 1.109556
C  0.94013 -2.053728 -1.217796
C  3.233281 1.77433 -0.100093
C  -0.858856 -1.787976 0.88036
C  -0.419552 -2.080454 -1.467563
C  -1.321997 -1.957824 -0.416717
C  1.894217 2.475822 -0.039484
C  0.788421 1.786142 -0.527459
C  1.7469 3.766807 0.44396
C  -0.453984 2.393974 -0.5318
C  4.287578 2.460396 0.649573
C  0.494223 4.368528 0.420622
C  -0.611564 3.695842 -0.067897
C  -3.6254 -1.860467 0.149348
C  -2.705782 1.65456 -0.45575
C  -3.810965 1.490271 -1.280481
C  -2.857547 1.728366 0.924084
C  -5.076315 1.408078 -0.719735
C  -4.132915 1.657024 1.468883
C  -5.246315 1.498765 0.655176
H  3.056505 -1.761201 1.438739
H  3.642454 -3.157227 -1.20471
H  5.236342 -3.007098 1.404089
H  5.664749 -2.158327 -0.080479
H  5.694777 -3.911656 -0.034587
H  3.022266 -4.352974 1.541429
H  2.0243 -4.515148 0.096559
H  3.618682 -5.250745 0.148488
H  0.863138 -1.624354 2.126075
H  1.621898 -2.157159 -2.053384
H  3.567937 1.715114 -1.141119
H  -1.523671 -1.694501 1.72824
H  -0.786048 -2.205965 -2.478608
H  0.874449 0.779373 -0.918317
H  2.591967 4.318784 0.834853
H  0.381539 5.379598 0.788853
H  -1.579302 4.180759 -0.086858
H  -3.529942 -0.950364 0.746184
H  -3.677047 1.425775 -2.35316
H  -2.000083 1.834904 1.576335
H  -5.934184 1.278633 -1.366763
H  -4.249873 1.716826 2.543334
H  -6.235985 1.440997 1.088309
elementType: F O N C H
totalener: -1560.11931968 hartree
nucrepener: 3441.72401488 hartree
electener: -5001.84333456 hartree
oneelecener: -8973.92100018 hartree
twoeener: 3972.07766562 hartree
cpcmener: -0.03418409 hartree
kineticenergy: 1553.61869622 hartree
xcener: -146.816862650735 hartree
chargesum: -0.0000000
charge: -0.210484 -0.195717 -0.278337 -0.419820 -0.274875 -0.324716 -0.083794 0.128489 0.063057 -0.096245 -0.292906 -0.311850 0.346877 -0.183755 -0.126637 0.421528 -0.162223 -0.224821 0.278970 -0.056863 -0.213335 -0.160683 0.219673 -0.236397 -0.127960 -0.173785 0.404684 0.320557 -0.254957 -0.211274 -0.123954 -0.135701 -0.180083 0.097017 0.045549 0.087933 0.095372 0.093682 0.089614 0.098547 0.098007 0.137629 0.140575 0.144832 0.136965 0.143493 0.154041 0.136843 0.160650 0.156262 0.098567 0.142557 0.150318 0.155774 0.156543 0.156565
qa: -0.2105 -0.1957 -0.2783 -0.4198 -0.2749 -0.3247 -0.0838 0.1285 0.0631 -0.0962 -0.2929 -0.3119 0.3469 -0.1838 -0.1266 0.4215 -0.1622 -0.2248 0.2790 -0.0569 -0.2133 -0.1607 0.2197 -0.2364 -0.1280 -0.1738 0.4047 0.3206 -0.2550 -0.2113 -0.1240 -0.1357 -0.1801 0.0970 0.0455 0.0879 0.0954 0.0937 0.0896 0.0985 0.0980 0.1376 0.1406 0.1448 0.1370 0.1435 0.1540 0.1368 0.1606 0.1563 0.0986 0.1426 0.1503 0.1558 0.1565 0.1566
va: 1.0632 1.0767 2.1407 2.0845 2.0513 2.0407 3.1112 3.6712 3.8078 3.5222 3.9288 3.9499 4.2392 4.0051 3.9039 3.7167 3.8756 4.0413 3.7267 3.8770 3.9743 3.9035 3.8198 4.0750 3.9297 3.9311 4.2666 3.5332 4.0020 3.8511 3.8360 3.8627 3.8869 1.0359 1.0272 1.0022 1.0137 1.0043 1.0022 1.0002 1.0045 1.0063 1.0138 1.0240 1.0123 1.0080 1.0008 1.0154 0.9909 0.9960 0.9833 1.0104 1.0041 0.9898 0.9918 0.9912
dispcorr: -0.035313785 hartree
energy: -1560.154633460623
dipole: 19.52619 -20.81151 -1.28532 -7.53179 7.76795 0.23616 3.90204 -3.27932 0.62273
magnitude: 1.44762 au
magnitude: 3.67956 debye
