program: Orca
programVersion: 5.0.2
elementType: F F O O O O N C C C C C C C C C C C C C C C C C C C C C C C C C C H H H H H H H H H H H H H H H H H H H H H H H
charge: 0
multiplicity: 1
keywords: wb97x-d3
keywords: def2-TZVPP
keywords: def2/J RIJCOSX
keywords: DEFGRID2
keywords: scfconv7
keywords: smallprint printgap noloewdin
keywords: NOSOSCF
formula: C26H23F2NO4
InChI: InChI=1/C26H23F2NO4/c1-17(2)24(18-11-13-21(14-12-18)32-26(27)28)25(30)33-23(16-29)19-7-6-10-22(15-19)31-20-8-4-3-5-9-20/h3-15,17,23-24,26H,1-2H3
56 atoms
F  -3.672341 -1.721487 -1.978411
F  -4.767343 -2.619091 -0.347629
O  3.38628 0.438572 0.578001
O  3.418885 -0.334838 -1.520736
O  -2.82798 -1.777561 0.089103
O  -1.281367 1.805444 1.151791
N  4.687494 3.126368 1.98473
C  2.846274 -1.83388 0.290329
C  3.52109 -3.053879 -0.355632
C  1.33044 -1.848523 0.209612
C  5.035397 -2.979581 -0.189036
C  2.985487 -4.337693 0.266531
C  3.26903 -0.530219 -0.345897
C  0.559275 -1.763261 1.36479
C  0.675985 -1.915747 -1.015539
C  3.444659 1.779581 0.122866
C  -0.824739 -1.751809 1.303579
C  -0.708706 -1.899104 -1.096891
C  -1.456158 -1.821987 0.070703
C  2.059382 2.35653 -0.087195
C  0.975824 1.821705 0.592391
C  1.887771 3.438149 -0.940663
C  -0.286935 2.367931 0.411324
C  4.144413 2.519072 1.175211
C  0.624909 3.992271 -1.088854
C  -0.469543 3.469326 -0.415334
C  -3.532189 -2.46007 -0.848758
C  -2.556502 1.643601 0.691613
C  -2.889243 1.533786 -0.652563
C  -3.532982 1.518754 1.672943
C  -4.21545 1.317002 -1.003559
C  -4.848785 1.287349 1.306158
C  -5.199564 1.192393 -0.034204
H  3.12753 -1.809288 1.346997
H  3.286718 -3.063271 -1.424446
H  5.469506 -2.09611 -0.660207
H  5.514403 -3.849699 -0.640523
H  5.313341 -2.963347 0.867588
H  3.157424 -4.356089 1.345663
H  1.915552 -4.465527 0.099118
H  3.487239 -5.207061 -0.160963
H  1.043938 -1.706649 2.33196
H  1.241423 -1.972506 -1.937113
H  4.036137 1.871752 -0.793957
H  -1.414119 -1.690035 2.209645
H  -1.173332 -1.929612 -2.072986
H  1.088748 0.98769 1.272026
H  2.730954 3.849498 -1.481541
H  0.486134 4.844667 -1.740648
H  -1.445247 3.921247 -0.538088
H  -3.104163 -3.430441 -1.11444
H  -2.136307 1.600287 -1.426912
H  -3.256492 1.596297 2.717276
H  -4.475269 1.241763 -2.051332
H  -5.603761 1.188427 2.075619
H  -6.229239 1.021302 -0.319149
elementType: F O N C H
totalener: -1560.11860484 hartree
nucrepener: 3462.96166007 hartree
electener: -5023.08026491 hartree
oneelecener: -9017.69088455 hartree
twoeener: 3994.61061964 hartree
cpcmener: -0.03789508 hartree
kineticenergy: 1553.63769874 hartree
xcener: -146.818553178250 hartree
chargesum: -0.0000000
charge: -0.215519 -0.205862 -0.284587 -0.420488 -0.294822 -0.320499 -0.085290 0.145922 0.059461 -0.054733 -0.293312 -0.311131 0.327624 -0.167587 -0.165914 0.374687 -0.228848 -0.173842 0.255825 0.078537 -0.263801 -0.226915 0.277788 -0.230196 -0.108184 -0.229387 0.393305 0.364090 -0.234031 -0.282739 -0.152148 -0.097360 -0.200411 0.089853 0.050580 0.095553 0.093336 0.090190 0.090021 0.097993 0.097794 0.140507 0.141899 0.146573 0.143091 0.145950 0.164422 0.146192 0.160685 0.159919 0.154716 0.153070 0.142012 0.154374 0.155984 0.155651
qa: -0.2155 -0.2059 -0.2846 -0.4205 -0.2948 -0.3205 -0.0853 0.1459 0.0595 -0.0547 -0.2933 -0.3111 0.3276 -0.1676 -0.1659 0.3747 -0.2288 -0.1738 0.2558 0.0785 -0.2638 -0.2269 0.2778 -0.2302 -0.1082 -0.2294 0.3933 0.3641 -0.2340 -0.2827 -0.1521 -0.0974 -0.2004 0.0899 0.0506 0.0956 0.0933 0.0902 0.0900 0.0980 0.0978 0.1405 0.1419 0.1466 0.1431 0.1460 0.1644 0.1462 0.1607 0.1599 0.1547 0.1531 0.1420 0.1544 0.1560 0.1557
va: 1.0506 1.0752 2.1260 2.0785 2.0421 2.0573 3.1146 3.6728 3.8101 3.5112 3.9267 3.9494 4.2293 3.9132 3.9877 3.7236 3.9675 3.9627 3.7378 3.6528 4.0427 4.0085 3.7679 4.0758 3.8680 3.9463 4.2153 3.5228 3.8576 4.0160 3.8691 3.8701 3.9026 1.0423 1.0250 1.0110 1.0043 1.0022 1.0023 1.0000 1.0047 1.0024 1.0200 1.0218 1.0074 1.0178 1.0127 1.0014 0.9894 0.9948 0.9739 1.0017 1.0112 0.9938 0.9889 0.9908
dispcorr: -0.035554914 hartree
energy: -1560.154159756636
dipole: 20.32668 -20.63409 -0.30741 -11.16065 9.70955 -1.45109 0.06651 -1.05210 -0.98559
magnitude: 1.78089 au
magnitude: 4.52666 debye
