program: Orca
programVersion: 5.0.2
elementType: F F O O O O N C C C C C C C C C C C C C C C C C C C C C C C C C C H H H H H H H H H H H H H H H H H H H H H H H
charge: 0
multiplicity: 1
keywords: wb97x-d3
keywords: def2-TZVPP
keywords: def2/J RIJCOSX
keywords: DEFGRID2
keywords: scfconv7
keywords: smallprint printgap noloewdin
keywords: NOSOSCF
formula: C26H23F2NO4
InChI: InChI=1/C26H23F2NO4/c1-17(2)24(18-11-13-21(14-12-18)32-26(27)28)25(30)33-23(16-29)19-7-6-10-22(15-19)31-20-8-4-3-5-9-20/h3-15,17,23-24,26H,1-2H3
56 atoms
F  -3.102053 -0.709811 -1.652608
F  -4.399516 -2.129041 -0.662729
O  3.31262 0.369584 0.804514
O  3.932561 -0.246974 -1.253479
O  -2.403774 -1.883474 0.107975
O  -1.71633 1.296815 0.892598
N  3.370274 3.210942 2.46704
C  3.263415 -1.93248 0.351685
C  4.008887 -3.038148 -0.405362
C  1.749591 -1.995173 0.248016
C  5.514982 -2.914601 -0.197758
C  3.527645 -4.407417 0.060138
C  3.584128 -0.542806 -0.142818
C  0.96222 -2.067665 1.392752
C  1.111429 -1.892946 -0.982612
C  3.069551 1.702701 0.357124
C  -0.418914 -2.044351 1.313429
C  -0.272785 -1.853401 -1.082054
C  -1.035753 -1.930703 0.075077
C  1.680971 1.797529 -0.227621
C  0.576311 1.570607 0.584964
C  1.51675 2.032064 -1.585175
C  -0.697358 1.580431 0.035765
C  3.226939 2.543711 1.543629
C  0.237537 2.033215 -2.123081
C  -0.872487 1.800587 -1.327443
C  -3.129213 -1.91784 -1.038228
C  -2.98005 1.793492 0.727588
C  -4.020702 0.982022 1.161197
C  -3.237727 3.064844 0.230257
C  -5.326637 1.438583 1.077094
C  -4.552117 3.503067 0.14075
C  -5.601208 2.695789 0.556664
H  3.532204 -1.995488 1.411087
H  3.793587 -2.942345 -1.474114
H  5.773263 -3.010799 0.859638
H  5.91476 -1.963841 -0.551595
H  6.042203 -3.703767 -0.736092
H  3.680505 -4.536212 1.134562
H  2.468857 -4.567392 -0.146085
H  4.080947 -5.199243 -0.447284
H  1.432331 -2.139177 2.365866
H  1.689636 -1.822703 -1.895777
H  3.817972 2.023993 -0.373561
H  -1.019934 -2.100418 2.212228
H  -0.713487 -1.740977 -2.063219
H  0.691987 1.385662 1.647042
H  2.375682 2.2089 -2.219227
H  0.100114 2.204986 -3.18249
H  -1.857152 1.796587 -1.774553
H  -2.81917 -2.68677 -1.750583
H  -3.807804 0.003973 1.571754
H  -2.433414 3.717212 -0.084378
H  -6.132993 0.800701 1.415359
H  -4.751287 4.490948 -0.254012
H  -6.622342 3.045411 0.482011
elementType: F O N C H
totalener: -1560.11848642 hartree
nucrepener: 3500.84058935 hartree
electener: -5060.95907578 hartree
oneelecener: -9093.68516201 hartree
twoeener: 4032.72608623 hartree
cpcmener: -0.03651503 hartree
kineticenergy: 1553.64510677 hartree
xcener: -146.821392616695 hartree
chargesum: 0.0000000
charge: -0.210090 -0.203932 -0.277599 -0.415827 -0.290754 -0.316367 -0.085874 0.125930 0.064147 -0.051792 -0.291525 -0.312601 0.318608 -0.142084 -0.217003 0.419223 -0.208151 -0.182502 0.293056 0.071111 -0.337872 -0.189211 0.359384 -0.241102 -0.117952 -0.242091 0.396728 0.331298 -0.282121 -0.224548 -0.116913 -0.147727 -0.184979 0.098816 0.044757 0.088829 0.094279 0.092517 0.089527 0.097988 0.097713 0.136956 0.141113 0.137409 0.142842 0.135928 0.131878 0.143349 0.159380 0.149612 0.154286 0.145044 0.156309 0.157169 0.158292 0.157140
qa: -0.2101 -0.2039 -0.2776 -0.4158 -0.2908 -0.3164 -0.0859 0.1259 0.0641 -0.0518 -0.2915 -0.3126 0.3186 -0.1421 -0.2170 0.4192 -0.2082 -0.1825 0.2931 0.0711 -0.3379 -0.1892 0.3594 -0.2411 -0.1180 -0.2421 0.3967 0.3313 -0.2821 -0.2245 -0.1169 -0.1477 -0.1850 0.0988 0.0448 0.0888 0.0943 0.0925 0.0895 0.0980 0.0977 0.1370 0.1411 0.1374 0.1428 0.1359 0.1319 0.1433 0.1594 0.1496 0.1543 0.1450 0.1563 0.1572 0.1583 0.1571
va: 1.0598 1.0807 2.1494 2.0812 2.0843 2.0521 3.1122 3.6726 3.8088 3.5230 3.9234 3.9503 4.2835 3.9480 3.9841 3.7307 3.9621 3.9002 3.7043 3.5414 4.0947 3.9626 3.5883 4.0822 3.9184 3.9254 4.2144 3.6447 3.9602 3.9222 3.8990 3.8939 3.9150 1.0370 1.0261 1.0019 1.0138 1.0046 1.0020 1.0006 1.0045 1.0033 1.0191 1.0157 1.0058 1.0155 1.0298 1.0091 0.9895 1.0088 0.9710 1.0264 0.9982 0.9905 0.9904 0.9905
dispcorr: -0.037022996 hartree
energy: -1560.155509421228
dipole: 21.62994 -21.85534 -0.22539 -12.65156 11.08234 -1.56922 -1.64309 0.03738 -1.60570
magnitude: 2.25644 au
magnitude: 5.73542 debye
