program: Orca
programVersion: 5.0.2
elementType: F F O O O O N C C C C C C C C C C C C C C C C C C C C C C C C C C H H H H H H H H H H H H H H H H H H H H H H H
charge: 0
multiplicity: 1
keywords: wb97x-d3
keywords: def2-TZVPP
keywords: def2/J RIJCOSX
keywords: DEFGRID2
keywords: scfconv7
keywords: smallprint printgap noloewdin
keywords: NOSOSCF
formula: C26H23F2NO4
InChI: InChI=1/C26H23F2NO4/c1-17(2)24(18-11-13-21(14-12-18)32-26(27)28)25(30)33-23(16-29)19-7-6-10-22(15-19)31-20-8-4-3-5-9-20/h3-15,17,23-24,26H,1-2H3
56 atoms
F  -4.790737 -2.501201 0.305304
F  -3.709537 -1.62979 1.961942
O  3.355464 0.321693 0.666074
O  3.437839 0.015601 -1.545111
O  -2.811822 -1.734474 -0.077417
O  -1.391012 1.765393 0.767321
N  4.201164 2.698757 2.784716
C  2.862945 -1.843713 -0.100932
C  3.471891 -2.885992 -1.051138
C  1.346371 -1.83487 -0.080195
C  4.993407 -2.883727 -0.940971
C  2.92376 -4.271288 -0.731068
C  3.272884 -0.430992 -0.442398
C  0.656472 -2.07404 1.099281
C  0.608521 -1.565699 -1.232284
C  3.440873 1.726473 0.481935
C  -0.732286 -2.048695 1.150089
C  -0.77384 -1.553258 -1.204763
C  -1.44457 -1.793548 -0.011997
C  2.109559 2.324407 0.081985
C  0.93308 1.776184 0.574492
C  2.073862 3.423311 -0.76358
C  -0.284174 2.332348 0.211683
C  3.868234 2.256429 1.778461
C  0.849402 3.98401 -1.097747
C  -0.334592 3.449875 -0.613757
C  -3.567049 -2.38364 0.84404
C  -2.555535 1.612734 0.068668
C  -3.717364 1.569074 0.827948
C  -2.602915 1.429156 -1.307856
C  -4.93298 1.329773 0.206537
C  -3.829424 1.200797 -1.916428
C  -4.996889 1.14621 -1.168172
H  3.21102 -2.063635 0.912868
H  3.194014 -2.633157 -2.078952
H  5.428558 -3.627672 -1.610027
H  5.31248 -3.129505 0.074845
H  5.43559 -1.921079 -1.202685
H  3.129328 -4.548665 0.305962
H  1.846292 -4.337828 -0.88479
H  3.389722 -5.022718 -1.370173
H  1.205319 -2.276588 2.010889
H  1.108912 -1.369034 -2.172435
H  4.209894 1.990505 -0.251486
H  -1.220074 -2.216487 2.100904
H  -1.336844 -1.358578 -2.108571
H  0.942302 0.922631 1.241359
H  2.992214 3.841747 -1.15587
H  0.813805 4.849069 -1.746732
H  -1.280523 3.903669 -0.880262
H  -3.185832 -3.368379 1.127281
H  -3.663916 1.710781 1.90018
H  -1.702727 1.448373 -1.908172
H  -5.834975 1.29151 0.803641
H  -3.865465 1.056185 -2.988624
H  -5.94729 0.962683 -1.651791
elementType: F O N C H
totalener: -1560.12019215 hartree
nucrepener: 3483.40983093 hartree
electener: -5043.53002308 hartree
oneelecener: -9058.79681768 hartree
twoeener: 4015.26679460 hartree
cpcmener: -0.03877250 hartree
kineticenergy: 1553.64536946 hartree
xcener: -146.820611527867 hartree
chargesum: -0.0000000
charge: -0.205717 -0.215798 -0.277880 -0.417526 -0.291793 -0.322869 -0.085451 0.134000 0.064282 -0.052322 -0.292681 -0.312577 0.319951 -0.210054 -0.142202 0.382217 -0.134860 -0.241516 0.259126 0.052907 -0.261254 -0.203186 0.269328 -0.230503 -0.119360 -0.207148 0.390242 0.405102 -0.312520 -0.265855 -0.100531 -0.125249 -0.205527 0.092890 0.047149 0.093728 0.089089 0.095404 0.089603 0.097577 0.098548 0.138679 0.140218 0.145890 0.145648 0.148733 0.151665 0.143918 0.160295 0.159377 0.154684 0.139754 0.154355 0.156190 0.157239 0.156590
qa: -0.2057 -0.2158 -0.2779 -0.4175 -0.2918 -0.3229 -0.0855 0.1340 0.0643 -0.0523 -0.2927 -0.3126 0.3200 -0.2101 -0.1422 0.3822 -0.1349 -0.2415 0.2591 0.0529 -0.2613 -0.2032 0.2693 -0.2305 -0.1194 -0.2071 0.3902 0.4051 -0.3125 -0.2659 -0.1005 -0.1252 -0.2055 0.0929 0.0471 0.0937 0.0891 0.0954 0.0896 0.0976 0.0985 0.1387 0.1402 0.1459 0.1456 0.1487 0.1517 0.1439 0.1603 0.1594 0.1547 0.1398 0.1544 0.1562 0.1572 0.1566
va: 1.0757 1.0492 2.1373 2.0794 2.0711 2.0540 3.1133 3.6848 3.8053 3.4993 3.9270 3.9519 4.2421 3.9909 3.9363 3.7376 3.8967 4.0059 3.7515 3.6207 4.0370 3.9938 3.7682 4.0801 3.8853 3.9358 4.2164 3.4468 4.0071 3.8861 3.8397 3.8875 3.9269 1.0403 1.0262 1.0044 1.0023 1.0117 1.0021 1.0001 1.0048 1.0061 1.0186 1.0159 1.0143 1.0019 1.0122 1.0021 0.9899 0.9950 0.9737 1.0130 0.9993 0.9886 0.9904 0.9907
dispcorr: -0.036342046 hartree
energy: -1560.156534192157
dipole: 21.38195 -21.35334 0.02861 -10.93973 9.54905 -1.39068 -13.05293 11.72595 -1.32699
magnitude: 1.92242 au
magnitude: 4.88641 debye
