program: Orca
programVersion: 5.0.2
elementType: F F O O O O N C C C C C C C C C C C C C C C C C C C C C C C C C C H H H H H H H H H H H H H H H H H H H H H H H
charge: 0
multiplicity: 1
keywords: wb97x-d3
keywords: def2-TZVPP
keywords: def2/J RIJCOSX
keywords: DEFGRID2
keywords: scfconv7
keywords: smallprint printgap noloewdin
keywords: NOSOSCF
formula: C26H23F2NO4
InChI: InChI=1/C26H23F2NO4/c1-17(2)24(18-11-13-21(14-12-18)32-26(27)28)25(30)33-23(16-29)19-7-6-10-22(15-19)31-20-8-4-3-5-9-20/h3-15,17,23-24,26H,1-2H3
56 atoms
F  -3.802434 -2.090012 -0.048873
F  -4.013041 -1.312899 -2.059377
O  3.09316 0.395502 0.780051
O  4.163599 -0.591072 -0.929221
O  -2.134891 -2.237756 -1.520298
O  -1.540322 3.224557 0.7461
N  3.802592 3.474792 1.783118
C  3.057317 -1.946713 0.73791
C  3.982427 -3.143963 0.49306
C  1.656212 -2.092233 0.1744
C  5.348908 -2.907155 1.128888
C  3.353836 -4.419199 1.04375
C  3.549432 -0.667517 0.096857
C  1.453637 -2.435638 -1.160872
C  0.545745 -1.804426 0.952284
C  3.018983 1.64539 0.094034
C  0.182719 -2.48128 -1.699736
C  -0.739823 -1.859544 0.432098
C  -0.915895 -2.180362 -0.905735
C  1.599769 1.828395 -0.386442
C  0.652916 2.477557 0.391695
C  1.2261 1.218724 -1.578916
C  -0.66767 2.526222 -0.030021
C  3.453297 2.66939 1.042824
C  -0.097808 1.26259 -1.982999
C  -1.051334 1.915937 -1.218622
C  -3.14641 -1.461592 -1.054521
C  -2.816707 2.753943 0.886206
C  -3.056435 1.450039 1.302964
C  -3.868648 3.623196 0.64654
C  -4.362861 1.015998 1.466284
C  -5.171772 3.179776 0.822681
C  -5.424494 1.876677 1.223312
H  2.974444 -1.786705 1.817822
H  4.126506 -3.262413 -0.584744
H  5.85446 -2.035205 0.714624
H  6.001354 -3.765249 0.965365
H  5.26093 -2.766167 2.20865
H  2.398633 -4.647451 0.571495
H  4.014177 -5.271632 0.882443
H  3.180736 -4.33909 2.119543
H  2.299945 -2.652978 -1.800039
H  0.676243 -1.535665 1.992982
H  3.711679 1.657197 -0.752887
H  0.033018 -2.739277 -2.739867
H  -1.580227 -1.677078 1.087657
H  0.924897 2.957922 1.323817
H  1.961213 0.707711 -2.186671
H  -0.392029 0.792279 -2.911697
H  -2.078967 1.967567 -1.556245
H  -2.817202 -0.481364 -0.69423
H  -2.224624 0.78807 1.512296
H  -3.663631 4.637445 0.330036
H  -4.551627 0.000618 1.78871
H  -5.993465 3.858413 0.636013
H  -6.441845 1.533418 1.351567
totalener: -1560.09132378 hartree
nucrepener: 3447.72042240 hartree
electener: -5007.81174617 hartree
oneelecener: -8985.39628090 hartree
twoeener: 3977.58453473 hartree
kineticenergy: 1553.71774181 hartree
xcener: -146.828071251112 hartree
chargesum: 0.0000000
charge: -0.196541 -0.178605 -0.252452 -0.347282 -0.256678 -0.295921 0.000303 0.082818 0.043299 -0.009446 -0.278775 -0.274559 0.284239 -0.160576 -0.154946 0.308821 -0.180905 -0.172850 0.229688 0.034446 -0.190064 -0.167878 0.222679 -0.264573 -0.109717 -0.207663 0.462590 0.221564 -0.191723 -0.183436 -0.136229 -0.102513 -0.117821 0.087396 0.046498 0.102832 0.085282 0.082727 0.100419 0.090296 0.079585 0.129331 0.108179 0.132328 0.129237 0.134939 0.124600 0.132896 0.134895 0.153267 0.008931 0.149136 0.130323 0.137516 0.129324 0.130768
qa: -0.1965 -0.1786 -0.2525 -0.3473 -0.2567 -0.2959 0.0003 0.0828 0.0433 -0.0094 -0.2788 -0.2746 0.2842 -0.1606 -0.1549 0.3088 -0.1809 -0.1728 0.2297 0.0344 -0.1901 -0.1679 0.2227 -0.2646 -0.1097 -0.2077 0.4626 0.2216 -0.1917 -0.1834 -0.1362 -0.1025 -0.1178 0.0874 0.0465 0.1028 0.0853 0.0827 0.1004 0.0903 0.0796 0.1293 0.1082 0.1323 0.1292 0.1349 0.1246 0.1329 0.1349 0.1533 0.0089 0.1491 0.1303 0.1375 0.1293 0.1308
va: 1.0735 1.1122 2.1269 2.1446 2.1038 2.1147 3.1138 3.7104 3.8300 3.5768 3.9350 3.9405 4.2932 3.9602 4.0422 3.8146 4.0268 3.8765 3.8675 3.6989 4.1013 3.9259 3.8904 4.0434 3.9082 3.8713 4.2855 3.8264 3.8776 4.0278 3.9088 3.9446 3.9605 1.0356 1.0259 1.0128 1.0068 1.0044 1.0046 1.0076 1.0053 1.0167 1.0163 1.0223 1.0117 1.0116 1.0318 1.0147 1.0032 0.9938 1.0041 0.9935 1.0113 1.0091 0.9980 0.9990
dispcorr: -0.036282522 hartree
energy: -1560.127606298589
dipole: 20.27476 -20.92615 -0.65139 -13.89222 13.02058 -0.87164 7.15415 -7.49071 -0.33655
magnitude: 1.13900 au
magnitude: 2.89512 debye
