program: Orca
programVersion: 5.0.2
elementType: F F O O O O N C C C C C C C C C C C C C C C C C C C C C C C C C C H H H H H H H H H H H H H H H H H H H H H H H
charge: 0
multiplicity: 1
keywords: wb97x-d3
keywords: def2-TZVPP
keywords: def2/J RIJCOSX
keywords: DEFGRID2
keywords: scfconv7
keywords: smallprint printgap noloewdin
keywords: NOSOSCF
formula: C26H23F2NO4
InChI: InChI=1/C26H23F2NO4/c1-17(2)24(18-11-13-21(14-12-18)32-26(27)28)25(30)33-23(16-29)19-7-6-10-22(15-19)31-20-8-4-3-5-9-20/h3-15,17,23-24,26H,1-2H3
56 atoms
F  -3.315447 -1.614729 -2.3230
F  -4.441893 -3.141698 -1.286922
O  3.233006 0.448619 0.813445
O  3.678902 -0.309772 -1.244466
O  -2.665157 -2.366587 -0.330501
O  -1.375802 2.780701 1.276312
N  4.068406 3.286587 2.316019
C  2.933633 -1.857605 0.450737
C  3.73341 -3.020801 -0.158276
C  1.439613 -1.968245 0.216627
C  5.221148 -2.87854 0.149506
C  3.211927 -4.355192 0.363452
C  3.349619 -0.516247 -0.109867
C  0.908733 -1.900726 -1.065388
C  0.561694 -2.145453 1.280656
C  3.260101 1.792603 0.333106
C  -0.454635 -2.017335 -1.291799
C  -0.799078 -2.284197 1.073709
C  -1.307113 -2.228552 -0.216318
C  1.887082 2.18132 -0.15163
C  0.854213 2.318484 0.765568
C  1.639977 2.305678 -1.510733
C  -0.428204 2.597617 0.322212
C  3.709114 2.615886 1.455991
C  0.35174 2.5840 -1.943439
C  -0.685547 2.732939 -1.038924
C  -3.203774 -2.704223 -1.528657
C  -2.671024 2.404386 1.050798
C  -3.665101 3.277689 1.464634
C  -2.992893 1.173944 0.492634
C  -4.99492 2.912216 1.322488
C  -4.327058 0.825899 0.34757
C  -5.330953 1.689734 0.760812
H  3.10713 -1.848416 1.531583
H  3.600735 -2.99647 -1.243931
H  5.400112 -2.873355 1.227174
H  5.649482 -1.968107 -0.268572
H  5.780051 -3.716664 -0.267798
H  3.787314 -5.179844 -0.058171
H  3.302546 -4.417147 1.450607
H  2.165586 -4.519008 0.107944
H  1.558796 -1.734755 -1.914631
H  0.945891 -2.186842 2.292176
H  3.990858 1.899584 -0.473982
H  -0.821776 -1.909612 -2.302773
H  -1.472421 -2.432589 1.907349
H  1.033789 2.219999 1.829444
H  2.441353 2.176289 -2.225677
H  0.15128 2.689977 -3.001067
H  -1.684382 2.957596 -1.389399
H  -2.633305 -3.470612 -2.065683
H  -3.392307 4.229489 1.901072
H  -2.213222 0.490883 0.181155
H  -5.770768 3.591767 1.649225
H  -4.579891 -0.132983 -0.083003
H  -6.369262 1.408946 0.648149
totalener: -1560.09408318 hartree
nucrepener: 3405.88626530 hartree
electener: -4965.98034848 hartree
oneelecener: -8902.39131304 hartree
twoeener: 3936.41096456 hartree
kineticenergy: 1553.71481608 hartree
xcener: -146.824481149311 hartree
chargesum: -0.0000000
charge: -0.197745 -0.182952 -0.253012 -0.358689 -0.272461 -0.294198 0.001127 0.095127 0.048997 -0.058833 -0.273070 -0.284970 0.287591 -0.186298 -0.100943 0.323651 -0.128361 -0.159459 0.179314 0.031852 -0.214448 -0.142332 0.219202 -0.268209 -0.112874 -0.149584 0.387252 0.227126 -0.191083 -0.161243 -0.099675 -0.123534 -0.139860 0.085853 0.048565 0.083440 0.099809 0.084804 0.092419 0.078851 0.097675 0.128839 0.110817 0.121267 0.128126 0.131287 0.117914 0.117388 0.129950 0.134528 0.115580 0.126888 0.141861 0.125231 0.125797 0.125706
qa: -0.1977 -0.1830 -0.2530 -0.3587 -0.2725 -0.2942 0.0011 0.0951 0.0490 -0.0588 -0.2731 -0.2850 0.2876 -0.1863 -0.1009 0.3237 -0.1284 -0.1595 0.1793 0.0319 -0.2144 -0.1423 0.2192 -0.2682 -0.1129 -0.1496 0.3873 0.2271 -0.1911 -0.1612 -0.0997 -0.1235 -0.1399 0.0859 0.0486 0.0834 0.0998 0.0848 0.0924 0.0789 0.0977 0.1288 0.1108 0.1213 0.1281 0.1313 0.1179 0.1174 0.1299 0.1345 0.1156 0.1269 0.1419 0.1252 0.1258 0.1257
va: 1.0779 1.1096 2.1545 2.1308 2.0925 2.1156 3.1183 3.7629 3.8158 3.6327 3.9287 3.9507 4.2794 4.0559 3.9761 3.8213 3.9226 4.0108 3.8766 3.6483 4.0715 3.9706 3.8965 4.0422 3.9563 3.9427 4.2564 3.8280 4.0160 3.9461 3.9410 3.9611 3.9777 1.0385 1.0259 1.0041 1.0141 1.0072 1.0077 1.0051 1.0026 1.0271 1.0101 1.0196 1.0207 1.0109 1.0304 1.0195 1.0002 1.0033 0.9822 1.0134 0.9883 0.9988 1.0246 1.0011
dispcorr: -0.033442642 hartree
energy: -1560.127525818453
dipole: 20.53764 -20.90563 -0.36800 -11.71598 10.23237 -1.48361 2.58690 -3.55430 -0.96740
magnitude: 1.80897 au
magnitude: 4.59803 debye
